{"text_format":"1","workbook":"xlsx","n_sheets":7,"sheets":["Eingabe","Punkte_Matrix","Noten_Matrix","ASV_Daten","Formeln","Ausgangstabelle","alle KLassen"],"not_rendered":{"charts":0,"images":0,"macros":1,"external_links":0,"defined_names":31,"comments":0,"pivot_tables":0},"unopened":[],"bounds":{"document_bytes":16777216,"sheet_cells":100000,"rows_first":2000,"rows_last":500,"rows_between":2000,"halvings":0,"cell_chars":16384,"cell_head_chars":4096},"cells_cut":0,"cells_raw":0,"read":"whole","date_system":"1900"}

{"sheet":"Eingabe","index":0,"n_rows":503,"n_cols":22,"rows_kept":503,"cut":false,"hidden":false,"merged":[]}
["Jahr",2021]
["Klasse","Name","Vorname","Geburtsjahr","Geschlecht","Kenng.","Alter","Kenn","Ausd","Sprint","Sprung","Wurf","Ausdauer","Sprint","Sprung","Wurf","Ges","Urkunde","Stufe","Note"]
[{"$f":"IF(ASV_Daten!A2=\"\",\"\",ASV_Daten!A2)","v":"5a"},{"$f":"IF(ASV_Daten!B2=\"\",\"\",ASV_Daten!B2)","v":"Alaba"},{"$f":"IF(ASV_Daten!C2=\"\",\"\",ASV_Daten!C2)","v":"David"},{"$f":"IF(ASV_Daten!D2=\"\",\"\",ASV_Daten!D2)","v":2011},{"$f":"IF(ASV_Daten!E2=\"\",\"\",ASV_Daten!E2)","v":"m"},{"$f":"A3&E3","v":"5am"},{"$f":"IF(D3=\"\",\"\",$B$1-$D3)","v":10},{"$f":"G3&E3","v":"10m"},500,12.38,1.98,7.5,{"$f":"IF(E3=\"w\",(((800/I3)-2.0232)/0.00647),(((1000/I3)-2.158)/0.006))","v":-26.333333333333318},{"$f":"IF($E3=\"w\",(((50/(J3+0.24))-3.648)/0.0066),IF($E3=\"M\",(((50/(J3+0.24))-3.79)/0.0069),0))","v":24.922483290842653},{"$f":"IF($E3=\"w\",((SQRT(K3)-1.0935)/0.00208),IF($E3=\"m\",((SQRT(K3)-1.15028)/0.00219),0))","v":117.28069769270728},{"$f":"IF(E3=\"w\",((SQRT(L3)-2.0232)/0.00874),IF($E3=\"M\",((SQRT(L3)-2.8)/0.011),0))","v":-5.5806556794699302},{"$f":"ROUND((SUM(M3:P3)-MIN(M3:P3)),0)","v":137},{"$f":"IF(H3=\"7w\",VLOOKUP(Q3,weiblich8,2),IF(H3=\"7m\",VLOOKUP(Q3,männlich8,2),IF(H3=\"8w\",VLOOKUP(Q3,weiblich8,2),IF(H3=\"8m\",VLOOKUP(Q3,männlich8,2),IF(H3=\"9w\",VLOOKUP(Q3,weiblich9,2),IF(H3=\"9m\",VLOOKUP(Q3,männlich9,2),IF(H3=\"10w\",VLOOKUP(Q3,weiblich10,2),IF(H3=\"10m\",VLOOKUP(Q3,männlich10,2),IF(H3=\"11w\",VLOOKUP(Q3,weiblich11,2),IF(H3=\"11m\",VLOOKUP(Q3,männlich11,2),IF(H3=\"12w\",VLOOKUP(Q3,weiblich12,2),IF(H3=\"12m\",VLOOKUP(Q3,männlich12,2),\"H\"))))))))))))","v":"T"},{"$f":"IF(AND(A3=\"1a\",E3=\"m\"),\"N1m\",IF(AND(A3=\"1a\",E3=\"w\"),\"N1w\",IF(AND(A3=\"1b\",E3=\"w\"),\"N1w\",IF(AND(A3=\"1b\",E3=\"m\"),\"N1m\",IF(AND(A3=\"2a\",E3=\"m\"),\"N2m\",IF(AND(A3=\"2a\",E3=\"w\"),\"N2w\",IF(AND(A3=\"2b\",E3=\"w\"),\"N2w\",IF(AND(A3=\"2b\",E3=\"m\"),\"N2m\",IF(AND(A3=\"3a\",E3=\"m\"),\"N3m\",IF(AND(A3=\"3a\",E3=\"w\"),\"N3w\",IF(AND(A3=\"3b\",E3=\"w\"),\"N3w\",IF(AND(A3=\"3b\",E3=\"m\"),\"N3m\",IF(AND(A3=\"4a\",E3=\"m\"),\"N4m\",IF(AND(A3=\"4a\",E3=\"w\"),\"N4w\",IF(AND(A3=\"4b\",E3=\"m\"),\"N4m\",IF(AND(A3=\"4b\",E3=\"w\"),\"N4w\"))))))))))))))))","v":false},{"$f":"IF(S3=\"n1m\",VLOOKUP(Q3,N1m,2),IF(S3=\"N1w\",VLOOKUP(Q3,N1w,2),IF(S3=\"N2m\",VLOOKUP(Q3,n2m,2),IF(S3=\"N2w\",VLOOKUP(Q3,n2w,2),IF(S3=\"N3w\",VLOOKUP(Q3,n3w,2),IF(S3=\"N3m\",VLOOKUP(Q3,n3m,2),IF(S3=\"N4w\",VLOOKUP(Q3,n4w,2),IF(S3=\"N4m\",VLOOKUP(Q3,n4m,2),\"nix\"))))))))","v":"nix"}]
[{"$f":"IF(ASV_Daten!A3=\"\",\"\",ASV_Daten!A3)","v":"5a"},{"$f":"IF(ASV_Daten!B3=\"\",\"\",ASV_Daten!B3)","v":"Belkahia"},{"$f":"IF(ASV_Daten!C3=\"\",\"\",ASV_Daten!C3)","v":"Semi"},{"$f":"IF(ASV_Daten!D3=\"\",\"\",ASV_Daten!D3)","v":2010},{"$f":"IF(ASV_Daten!E3=\"\",\"\",ASV_Daten!E3)","v":"m"},{"$f":"A4&E4","v":"5am"},{"$f":"IF(D4=\"\",\"\",$B$1-$D4)","v":11},"11m",500,11.25,1.35,6,-26.333333333333318,81.392767497887277,5.3036547316096518,-31.864568837892907,60,"T",false,"nix"]
[{"$f":"IF(ASV_Daten!A4=\"\",\"\",ASV_Daten!A4)","v":"5a"},{"$f":"IF(ASV_Daten!B4=\"\",\"\",ASV_Daten!B4)","v":"Dressel"},{"$f":"IF(ASV_Daten!C4=\"\",\"\",ASV_Daten!C4)","v":"Dennis"},{"$f":"IF(ASV_Daten!D4=\"\",\"\",ASV_Daten!D4)","v":2011},{"$f":"IF(ASV_Daten!E4=\"\",\"\",ASV_Daten!E4)","v":"m"},{"$f":"A5&E5","v":"5am"},10,"10m",500,12.94,1.61,7.5,-26.333333333333318,0.5256097292780294,54.145093171211045,-5.5806556794699302,49,"T",false,"nix"]
[{"$f":"IF(ASV_Daten!A5=\"\",\"\",ASV_Daten!A5)","v":"5a"},{"$f":"IF(ASV_Daten!B5=\"\",\"\",ASV_Daten!B5)","v":"Djajo"},{"$f":"IF(ASV_Daten!C5=\"\",\"\",ASV_Daten!C5)","v":"Johann"},{"$f":"IF(ASV_Daten!D5=\"\",\"\",ASV_Daten!D5)","v":2011},{"$f":"IF(ASV_Daten!E5=\"\",\"\",ASV_Daten!E5)","v":"m"},"5am",10,"10m",500,11.19,2,7,-26.333333333333318,84.703361355192939,120.51760838954117,-14.022608085037191,191,"T",false,"nix"]
[{"$f":"IF(ASV_Daten!A6=\"\",\"\",ASV_Daten!A6)","v":"5a"},{"$f":"IF(ASV_Daten!B6=\"\",\"\",ASV_Daten!B6)","v":"Hiller"},{"$f":"IF(ASV_Daten!C6=\"\",\"\",ASV_Daten!C6)","v":"Marco"},{"$f":"IF(ASV_Daten!D6=\"\",\"\",ASV_Daten!D6)","v":2011},{"$f":"IF(ASV_Daten!E6=\"\",\"\",ASV_Daten!E6)","v":"m"},"5am",10,"10m",500,10.94,1.9,8,-26.333333333333318,98.879987555417344,104.166609684485,2.5842840678354975,206,"T",false,"nix"]
[{"$f":"IF(ASV_Daten!A7=\"\",\"\",ASV_Daten!A7)","v":"5a"},{"$f":"IF(ASV_Daten!B7=\"\",\"\",ASV_Daten!B7)","v":"Lex"},{"$f":"IF(ASV_Daten!C7=\"\",\"\",ASV_Daten!C7)","v":"Stefan"},{"$f":"IF(ASV_Daten!D7=\"\",\"\",ASV_Daten!D7)","v":2010},{"$f":"IF(ASV_Daten!E7=\"\",\"\",ASV_Daten!E7)","v":"m"},"5am",11,"11m",500,11.1,1.7,6,-26.333333333333318,89.73493852720911,70.11894111439716,-31.864568837892907,134,"T",false,"nix"]
[{"$f":"IF(ASV_Daten!A8=\"\",\"\",ASV_Daten!A8)","v":"5a"},{"$f":"IF(ASV_Daten!B8=\"\",\"\",ASV_Daten!B8)","v":"Mölders "},{"$f":"IF(ASV_Daten!C8=\"\",\"\",ASV_Daten!C8)","v":"Sascha"},{"$f":"IF(ASV_Daten!D8=\"\",\"\",ASV_Daten!D8)","v":2011},{"$f":"IF(ASV_Daten!E8=\"\",\"\",ASV_Daten!E8)","v":"m"},"5am",10,"10m",500,11,2.23,9,-26.333333333333318,95.420083552529803,156.63856269717257,18.181818181818198,270,"T",false,"nix"]
[{"$f":"IF(ASV_Daten!A9=\"\",\"\",ASV_Daten!A9)","v":"5a"},{"$f":"IF(ASV_Daten!B9=\"\",\"\",ASV_Daten!B9)","v":"Tallig"},{"$f":"IF(ASV_Daten!C9=\"\",\"\",ASV_Daten!C9)","v":"Erik"},{"$f":"IF(ASV_Daten!D9=\"\",\"\",ASV_Daten!D9)","v":2011},{"$f":"IF(ASV_Daten!E9=\"\",\"\",ASV_Daten!E9)","v":"m"},"5am",10,"10m",500,10.220000000000001,2.0499999999999998,10.5,-26.333333333333318,143.4948873555573,128.53977457882888,40.033668109448215,312,"T",false,"nix"]
[{"$f":"IF(ASV_Daten!A10=\"\",\"\",ASV_Daten!A10)","v":"5a"},{"$f":"IF(ASV_Daten!B10=\"\",\"\",ASV_Daten!B10)","v":"Belkner"},{"$f":"IF(ASV_Daten!C10=\"\",\"\",ASV_Daten!C10)","v":"Jerome"},{"$f":"IF(ASV_Daten!D10=\"\",\"\",ASV_Daten!D10)","v":2010},{"$f":"IF(ASV_Daten!E10=\"\",\"\",ASV_Daten!E10)","v":"m"},"5am",11,"11m",500,11.12,1.85,7.5,-26.333333333333318,88.609920391916802,95.829703595225695,-5.5806556794699302,179,"T",false,"nix"]
[{"$f":"IF(ASV_Daten!A11=\"\",\"\",ASV_Daten!A11)","v":"5a"},{"$f":"IF(ASV_Daten!B11=\"\",\"\",ASV_Daten!B11)","v":"Zeppelin"},{"$f":"IF(ASV_Daten!C11=\"\",\"\",ASV_Daten!C11)","v":"Leni"},{"$f":"IF(ASV_Daten!D11=\"\",\"\",ASV_Daten!D11)","v":2011},{"$f":"IF(ASV_Daten!E11=\"\",\"\",ASV_Daten!E11)","v":"w"},"5aw",10,"10w",500,11.3,2,7.5,-65.409582689335394,103.75085342156395,154.18921267937273,81.855010014397081,340,"T",false,"nix"]
[{"$f":"IF(ASV_Daten!A12=\"\",\"\",ASV_Daten!A12)","v":"5a"},{"$f":"IF(ASV_Daten!B12=\"\",\"\",ASV_Daten!B12)","v":"Kallote"},{"$f":"IF(ASV_Daten!C12=\"\",\"\",ASV_Daten!C12)","v":"Marus"},{"$f":"IF(ASV_Daten!D12=\"\",\"\",ASV_Daten!D12)","v":2011},{"$f":"IF(ASV_Daten!E12=\"\",\"\",ASV_Daten!E12)","v":"m"},"5am",10,"10m",500,10.25,2.2799999999999998,10.5,-26.333333333333318,141.51365689890991,164.24058769595882,40.033668109448215,346,"T",false,"nix"]
[{"$f":"IF(ASV_Daten!A13=\"\",\"\",ASV_Daten!A13)","v":"5a"},{"$f":"IF(ASV_Daten!B13=\"\",\"\",ASV_Daten!B13)","v":"Alaba"},{"$f":"IF(ASV_Daten!C13=\"\",\"\",ASV_Daten!C13)","v":"David"},{"$f":"IF(ASV_Daten!D13=\"\",\"\",ASV_Daten!D13)","v":2011},{"$f":"IF(ASV_Daten!E13=\"\",\"\",ASV_Daten!E13)","v":"m"},"5am",10,"10m",500,10.62,2.0499999999999998,6.5,-26.333333333333318,117.97848773587427,128.53977457882888,-22.771840291237055,224,"T",false,"nix"]
[{"$f":"IF(ASV_Daten!A14=\"\",\"\",ASV_Daten!A14)","v":"5a"},{"$f":"IF(ASV_Daten!B14=\"\",\"\",ASV_Daten!B14)","v":"Dressel"},{"$f":"IF(ASV_Daten!C14=\"\",\"\",ASV_Daten!C14)","v":"Dennis"},{"$f":"IF(ASV_Daten!D14=\"\",\"\",ASV_Daten!D14)","v":2011},{"$f":"IF(ASV_Daten!E14=\"\",\"\",ASV_Daten!E14)","v":"m"},"5am",10,"10m",500,10.59,2.67,10.5,-26.333333333333318,119.82683635098429,220.88286019946079,40.033668109448215,381,"T",false,"nix"]
[{"$f":"IF(ASV_Daten!A15=\"\",\"\",ASV_Daten!A15)","v":"5a"},{"$f":"IF(ASV_Daten!B15=\"\",\"\",ASV_Daten!B15)","v":"Djajo"},{"$f":"IF(ASV_Daten!C15=\"\",\"\",ASV_Daten!C15)","v":"Johann"},{"$f":"IF(ASV_Daten!D15=\"\",\"\",ASV_Daten!D15)","v":2011},{"$f":"IF(ASV_Daten!E15=\"\",\"\",ASV_Daten!E15)","v":"m"},"5am",10,"10m",500,10.88,2.04,8,-26.333333333333318,102.37722865186106,126.94323548336529,2.5842840678354975,232,"T",false,"nix"]
[{"$f":"IF(ASV_Daten!A16=\"\",\"\",ASV_Daten!A16)","v":"5a"},{"$f":"IF(ASV_Daten!B16=\"\",\"\",ASV_Daten!B16)","v":"Hiller"},{"$f":"IF(ASV_Daten!C16=\"\",\"\",ASV_Daten!C16)","v":"Marco"},{"$f":"IF(ASV_Daten!D16=\"\",\"\",ASV_Daten!D16)","v":2011},{"$f":"IF(ASV_Daten!E16=\"\",\"\",ASV_Daten!E16)","v":"m"},"5am",10,"10m",500,10.220000000000001,2.4700000000000002,11.5,-26.333333333333318,143.4948873555573,192.39423038820601,53.742271960239478,390,"T",false,"nix"]
[{"$f":"IF(ASV_Daten!A17=\"\",\"\",ASV_Daten!A17)","v":"5a"},{"$f":"IF(ASV_Daten!B17=\"\",\"\",ASV_Daten!B17)","v":"Lex"},{"$f":"IF(ASV_Daten!C17=\"\",\"\",ASV_Daten!C17)","v":"Stefan"},{"$f":"IF(ASV_Daten!D17=\"\",\"\",ASV_Daten!D17)","v":2010},{"$f":"IF(ASV_Daten!E17=\"\",\"\",ASV_Daten!E17)","v":"m"},"5am",11,"11m",500,10.25,2.2400000000000002,15,-26.333333333333318,141.51365689890991,158.16573274409893,97.54394056431066,397,"T",false,"nix"]
[{"$f":"IF(ASV_Daten!A18=\"\",\"\",ASV_Daten!A18)","v":"5a"},{"$f":"IF(ASV_Daten!B18=\"\",\"\",ASV_Daten!B18)","v":"Mölders "},{"$f":"IF(ASV_Daten!C18=\"\",\"\",ASV_Daten!C18)","v":"Sascha"},{"$f":"IF(ASV_Daten!D18=\"\",\"\",ASV_Daten!D18)","v":2011},{"$f":"IF(ASV_Daten!E18=\"\",\"\",ASV_Daten!E18)","v":"m"},"5am",10,"10m",500,10.44,2.06,7.5,-26.333333333333318,129.22433914129081,130.13242440216095,-5.5806556794699302,254,"T",false,"nix"]
[{"$f":"IF(ASV_Daten!A19=\"\",\"\",ASV_Daten!A19)","v":"5a"},{"$f":"IF(ASV_Daten!B19=\"\",\"\",ASV_Daten!B19)","v":"Tallig"},{"$f":"IF(ASV_Daten!C19=\"\",\"\",ASV_Daten!C19)","v":"Erik"},{"$f":"IF(ASV_Daten!D19=\"\",\"\",ASV_Daten!D19)","v":2011},{"$f":"IF(ASV_Daten!E19=\"\",\"\",ASV_Daten!E19)","v":"m"},"5am",10,"10m",500,10.43,2.2000000000000002,6.5,-26.333333333333318,129.8602338942994,152.03639151558568,-22.771840291237055,259,"T",false,"nix",null,{"$f":"VLOOKUP(\"1a\",A14:E20,5)","v":{"$error":"#N/A"}}]
[{"$f":"IF(ASV_Daten!A20=\"\",\"\",ASV_Daten!A20)","v":"5a"},{"$f":"IF(ASV_Daten!B20=\"\",\"\",ASV_Daten!B20)","v":"Zeppelin"},{"$f":"IF(ASV_Daten!C20=\"\",\"\",ASV_Daten!C20)","v":"Leni"},{"$f":"IF(ASV_Daten!D20=\"\",\"\",ASV_Daten!D20)","v":2011},{"$f":"IF(ASV_Daten!E20=\"\",\"\",ASV_Daten!E20)","v":"w"},"5aw",{"$f":"IF(ASV_Daten!D20=\"\",\"\",$B$1-ASV_Daten!$D20)","v":10},{"$f":"G21&ASV_Daten!E20","v":"10w"},500,10.97,2.25,8,{"$f":"IF(ASV_Daten!E20=\"w\",(((800/I21)-2.0232)/0.00647),(((1000/I21)-2.158)/0.006))","v":-65.409582689335394},{"$f":"IF(ASV_Daten!$E20=\"w\",(((50/(J21+0.24))-3.648)/0.0066),IF(ASV_Daten!$E20=\"M\",(((50/(J21+0.24))-3.79)/0.0069),0))","v":123.07625767037004},{"$f":"IF(ASV_Daten!$E20=\"w\",((SQRT(K21)-1.0935)/0.00208),IF(ASV_Daten!$E20=\"m\",((SQRT(K21)-1.15028)/0.00219),0))","v":195.43269230769238},{"$f":"IF(ASV_Daten!E20=\"w\",((SQRT(L21)-2.0232)/0.00874),IF(ASV_Daten!$E20=\"M\",((SQRT(L21)-2.8)/0.011),0))","v":92.131249970959985},411,"T",{"$f":"IF(AND(ASV_Daten!A20=\"1a\",ASV_Daten!E20=\"m\"),\"N1m\",IF(AND(ASV_Daten!A20=\"1a\",ASV_Daten!E20=\"w\"),\"N1w\",IF(AND(ASV_Daten!A20=\"1b\",ASV_Daten!E20=\"w\"),\"N1w\",IF(AND(ASV_Daten!A20=\"1b\",ASV_Daten!E20=\"m\"),\"N1m\",IF(AND(ASV_Daten!A20=\"2a\",ASV_Daten!E20=\"m\"),\"N2m\",IF(AND(ASV_Daten!A20=\"2a\",ASV_Daten!E20=\"w\"),\"N2w\",IF(AND(ASV_Daten!A20=\"2b\",ASV_Daten!E20=\"w\"),\"N2w\",IF(AND(ASV_Daten!A20=\"2b\",ASV_Daten!E20=\"m\"),\"N2m\",IF(AND(ASV_Daten!A20=\"3a\",ASV_Daten!E20=\"m\"),\"N3m\",IF(AND(ASV_Daten!A20=\"3a\",ASV_Daten!E20=\"w\"),\"N3w\",IF(AND(ASV_Daten!A20=\"3b\",ASV_Daten!E20=\"w\"),\"N3w\",IF(AND(ASV_Daten!A20=\"3b\",ASV_Daten!E20=\"m\"),\"N3m\",IF(AND(ASV_Daten!A20=\"4a\",ASV_Daten!E20=\"m\"),\"N4m\",IF(AND(ASV_Daten!A20=\"4a\",ASV_Daten!E20=\"w\"),\"N4w\",IF(AND(ASV_Daten!A20=\"4b\",ASV_Daten!E20=\"m\"),\"N4m\",IF(AND(ASV_Daten!A20=\"4b\",ASV_Daten!E20=\"w\"),\"N4w\"))))))))))))))))","v":false},"nix",null,{"$f":"VLOOKUP(\"1a\",A15:E20,5)","v":{"$error":"#N/A"}}]
[{"$f":"IF(ASV_Daten!A21=\"\",\"\",ASV_Daten!A21)","v":"5a"},{"$f":"IF(ASV_Daten!B21=\"\",\"\",ASV_Daten!B21)","v":"Kallote"},{"$f":"IF(ASV_Daten!C21=\"\",\"\",ASV_Daten!C21)","v":"Marus"},{"$f":"IF(ASV_Daten!D21=\"\",\"\",ASV_Daten!D21)","v":2011},{"$f":"IF(ASV_Daten!E21=\"\",\"\",ASV_Daten!E21)","v":"m"},"5am",{"$f":"IF(ASV_Daten!D21=\"\",\"\",$B$1-ASV_Daten!$D21)","v":10},{"$f":"G22&ASV_Daten!E21","v":"10m"},500,10,2.44,14,{"$f":"IF(ASV_Daten!E21=\"w\",(((800/I22)-2.0232)/0.00647),(((1000/I22)-2.158)/0.006))","v":-26.333333333333318},{"$f":"IF(ASV_Daten!$E21=\"w\",(((50/(J22+0.24))-3.648)/0.0066),IF(ASV_Daten!$E21=\"M\",(((50/(J22+0.24))-3.79)/0.0069),0))","v":158.37862318840578},{"$f":"IF(ASV_Daten!$E21=\"w\",((SQRT(K22)-1.0935)/0.00208),IF(ASV_Daten!$E21=\"m\",((SQRT(K22)-1.15028)/0.00219),0))","v":188.02280145266249},{"$f":"IF(ASV_Daten!E21=\"w\",((SQRT(L22)-2.0232)/0.00874),IF(ASV_Daten!$E21=\"M\",((SQRT(L22)-2.8)/0.011),0))","v":85.605216979449239},432,"T",{"$f":"IF(AND(ASV_Daten!A21=\"1a\",ASV_Daten!E21=\"m\"),\"N1m\",IF(AND(ASV_Daten!A21=\"1a\",ASV_Daten!E21=\"w\"),\"N1w\",IF(AND(ASV_Daten!A21=\"1b\",ASV_Daten!E21=\"w\"),\"N1w\",IF(AND(ASV_Daten!A21=\"1b\",ASV_Daten!E21=\"m\"),\"N1m\",IF(AND(ASV_Daten!A21=\"2a\",ASV_Daten!E21=\"m\"),\"N2m\",IF(AND(ASV_Daten!A21=\"2a\",ASV_Daten!E21=\"w\"),\"N2w\",IF(AND(ASV_Daten!A21=\"2b\",ASV_Daten!E21=\"w\"),\"N2w\",IF(AND(ASV_Daten!A21=\"2b\",ASV_Daten!E21=\"m\"),\"N2m\",IF(AND(ASV_Daten!A21=\"3a\",ASV_Daten!E21=\"m\"),\"N3m\",IF(AND(ASV_Daten!A21=\"3a\",ASV_Daten!E21=\"w\"),\"N3w\",IF(AND(ASV_Daten!A21=\"3b\",ASV_Daten!E21=\"w\"),\"N3w\",IF(AND(ASV_Daten!A21=\"3b\",ASV_Daten!E21=\"m\"),\"N3m\",IF(AND(ASV_Daten!A21=\"4a\",ASV_Daten!E21=\"m\"),\"N4m\",IF(AND(ASV_Daten!A21=\"4a\",ASV_Daten!E21=\"w\"),\"N4w\",IF(AND(ASV_Daten!A21=\"4b\",ASV_Daten!E21=\"m\"),\"N4m\",IF(AND(ASV_Daten!A21=\"4b\",ASV_Daten!E21=\"w\"),\"N4w\"))))))))))))))))","v":false},"nix",null,{"$f":"VLOOKUP(\"1a\",A16:E20,5)","v":{"$error":"#N/A"}}]
[{"$f":"IF(ASV_Daten!A22=\"\",\"\",ASV_Daten!A22)","v":"5a"},{"$f":"IF(ASV_Daten!B22=\"\",\"\",ASV_Daten!B22)","v":"Alaba"},{"$f":"IF(ASV_Daten!C22=\"\",\"\",ASV_Daten!C22)","v":"David"},{"$f":"IF(ASV_Daten!D22=\"\",\"\",ASV_Daten!D22)","v":2011},{"$f":"IF(ASV_Daten!E22=\"\",\"\",ASV_Daten!E22)","v":"m"},"5am",{"$f":"IF(ASV_Daten!D22=\"\",\"\",$B$1-ASV_Daten!$D22)","v":10},{"$f":"G23&ASV_Daten!E22","v":"10m"},500,10.28,2.15,8.5,{"$f":"IF(ASV_Daten!E22=\"w\",(((800/I23)-2.0232)/0.00647),(((1000/I23)-2.158)/0.006))","v":-26.333333333333318},{"$f":"IF(ASV_Daten!$E22=\"w\",(((50/(J23+0.24))-3.648)/0.0066),IF(ASV_Daten!$E22=\"M\",(((50/(J23+0.24))-3.79)/0.0069),0))","v":139.54372623574145},{"$f":"IF(ASV_Daten!$E22=\"w\",((SQRT(K23)-1.0935)/0.00208),IF(ASV_Daten!$E22=\"m\",((SQRT(K23)-1.15028)/0.00219),0))","v":144.29581272215438},{"$f":"IF(ASV_Daten!E22=\"w\",((SQRT(L23)-2.0232)/0.00874),IF(ASV_Daten!$E22=\"M\",((SQRT(L23)-2.8)/0.011),0))","v":10.497813402059142},294,"T",{"$f":"IF(AND(ASV_Daten!A22=\"1a\",ASV_Daten!E22=\"m\"),\"N1m\",IF(AND(ASV_Daten!A22=\"1a\",ASV_Daten!E22=\"w\"),\"N1w\",IF(AND(ASV_Daten!A22=\"1b\",ASV_Daten!E22=\"w\"),\"N1w\",IF(AND(ASV_Daten!A22=\"1b\",ASV_Daten!E22=\"m\"),\"N1m\",IF(AND(ASV_Daten!A22=\"2a\",ASV_Daten!E22=\"m\"),\"N2m\",IF(AND(ASV_Daten!A22=\"2a\",ASV_Daten!E22=\"w\"),\"N2w\",IF(AND(ASV_Daten!A22=\"2b\",ASV_Daten!E22=\"w\"),\"N2w\",IF(AND(ASV_Daten!A22=\"2b\",ASV_Daten!E22=\"m\"),\"N2m\",IF(AND(ASV_Daten!A22=\"3a\",ASV_Daten!E22=\"m\"),\"N3m\",IF(AND(ASV_Daten!A22=\"3a\",ASV_Daten!E22=\"w\"),\"N3w\",IF(AND(ASV_Daten!A22=\"3b\",ASV_Daten!E22=\"w\"),\"N3w\",IF(AND(ASV_Daten!A22=\"3b\",ASV_Daten!E22=\"m\"),\"N3m\",IF(AND(ASV_Daten!A22=\"4a\",ASV_Daten!E22=\"m\"),\"N4m\",IF(AND(ASV_Daten!A22=\"4a\",ASV_Daten!E22=\"w\"),\"N4w\",IF(AND(ASV_Daten!A22=\"4b\",ASV_Daten!E22=\"m\"),\"N4m\",IF(AND(ASV_Daten!A22=\"4b\",ASV_Daten!E22=\"w\"),\"N4w\"))))))))))))))))","v":false},"nix",null,{"$f":"VLOOKUP(\"1a\",A17:E20,5)","v":{"$error":"#N/A"}}]
[{"$f":"IF(ASV_Daten!A23=\"\",\"\",ASV_Daten!A23)","v":"5a"},{"$f":"IF(ASV_Daten!B23=\"\",\"\",ASV_Daten!B23)","v":"Belkahia"},{"$f":"IF(ASV_Daten!C23=\"\",\"\",ASV_Daten!C23)","v":"Semi"},{"$f":"IF(ASV_Daten!D23=\"\",\"\",ASV_Daten!D23)","v":2010},{"$f":"IF(ASV_Daten!E23=\"\",\"\",ASV_Daten!E23)","v":"m"},"5am",{"$f":"IF(ASV_Daten!D27=\"\",\"\",$B$1-ASV_Daten!$D27)","v":11},{"$f":"G24&ASV_Daten!E27","v":"11m"},500,10.1,2.52,7.5,{"$f":"IF(ASV_Daten!E27=\"w\",(((800/I24)-2.0232)/0.00647),(((1000/I24)-2.158)/0.006))","v":-26.333333333333318},{"$f":"IF(ASV_Daten!$E27=\"w\",(((50/(J24+0.24))-3.648)/0.0066),IF(ASV_Daten!$E27=\"M\",(((50/(J24+0.24))-3.79)/0.0069),0))","v":151.53477419897402},{"$f":"IF(ASV_Daten!$E27=\"w\",((SQRT(K24)-1.0935)/0.00208),IF(ASV_Daten!$E27=\"m\",((SQRT(K24)-1.15028)/0.00219),0))","v":199.62136376198831},{"$f":"IF(ASV_Daten!E27=\"w\",((SQRT(L24)-2.0232)/0.00874),IF(ASV_Daten!$E27=\"M\",((SQRT(L24)-2.8)/0.011),0))","v":-5.5806556794699302},346,"T",{"$f":"IF(AND(ASV_Daten!A27=\"1a\",ASV_Daten!E27=\"m\"),\"N1m\",IF(AND(ASV_Daten!A27=\"1a\",ASV_Daten!E27=\"w\"),\"N1w\",IF(AND(ASV_Daten!A27=\"1b\",ASV_Daten!E27=\"w\"),\"N1w\",IF(AND(ASV_Daten!A27=\"1b\",ASV_Daten!E27=\"m\"),\"N1m\",IF(AND(ASV_Daten!A27=\"2a\",ASV_Daten!E27=\"m\"),\"N2m\",IF(AND(ASV_Daten!A27=\"2a\",ASV_Daten!E27=\"w\"),\"N2w\",IF(AND(ASV_Daten!A27=\"2b\",ASV_Daten!E27=\"w\"),\"N2w\",IF(AND(ASV_Daten!A27=\"2b\",ASV_Daten!E27=\"m\"),\"N2m\",IF(AND(ASV_Daten!A27=\"3a\",ASV_Daten!E27=\"m\"),\"N3m\",IF(AND(ASV_Daten!A27=\"3a\",ASV_Daten!E27=\"w\"),\"N3w\",IF(AND(ASV_Daten!A27=\"3b\",ASV_Daten!E27=\"w\"),\"N3w\",IF(AND(ASV_Daten!A27=\"3b\",ASV_Daten!E27=\"m\"),\"N3m\",IF(AND(ASV_Daten!A27=\"4a\",ASV_Daten!E27=\"m\"),\"N4m\",IF(AND(ASV_Daten!A27=\"4a\",ASV_Daten!E27=\"w\"),\"N4w\",IF(AND(ASV_Daten!A27=\"4b\",ASV_Daten!E27=\"m\"),\"N4m\",IF(AND(ASV_Daten!A27=\"4b\",ASV_Daten!E27=\"w\"),\"N4w\"))))))))))))))))","v":false},"nix",null,{"$f":"VLOOKUP(\"1a\",A18:E20,5)","v":{"$error":"#N/A"}}]
[{"$f":"IF(ASV_Daten!A24=\"\",\"\",ASV_Daten!A24)","v":"5a"},{"$f":"IF(ASV_Daten!B24=\"\",\"\",ASV_Daten!B24)","v":"Dressel"},{"$f":"IF(ASV_Daten!C24=\"\",\"\",ASV_Daten!C24)","v":"Dennis"},{"$f":"IF(ASV_Daten!D24=\"\",\"\",ASV_Daten!D24)","v":2011},{"$f":"IF(ASV_Daten!E24=\"\",\"\",ASV_Daten!E24)","v":"m"},"5am",{"$f":"IF(ASV_Daten!D30=\"\",\"\",$B$1-ASV_Daten!$D30)","v":11},{"$f":"G25&ASV_Daten!E30","v":"11m"},500,10.130000000000001,2.4,13,{"$f":"IF(ASV_Daten!E30=\"w\",(((800/I25)-2.0232)/0.00647),(((1000/I25)-2.158)/0.006))","v":-26.333333333333318},{"$f":"IF(ASV_Daten!$E30=\"w\",(((50/(J25+0.24))-3.648)/0.0066),IF(ASV_Daten!$E30=\"M\",(((50/(J25+0.24))-3.79)/0.0069),0))","v":149.50735818204683},{"$f":"IF(ASV_Daten!$E30=\"w\",((SQRT(K25)-1.0935)/0.00208),IF(ASV_Daten!$E30=\"m\",((SQRT(K25)-1.15028)/0.00219),0))","v":182.15220935295289},{"$f":"IF(ASV_Daten!E30=\"w\",((SQRT(L25)-2.0232)/0.00874),IF(ASV_Daten!$E30=\"M\",((SQRT(L25)-2.8)/0.011),0))","v":73.231934133089936},405,"T",{"$f":"IF(AND(ASV_Daten!A30=\"1a\",ASV_Daten!E30=\"m\"),\"N1m\",IF(AND(ASV_Daten!A30=\"1a\",ASV_Daten!E30=\"w\"),\"N1w\",IF(AND(ASV_Daten!A30=\"1b\",ASV_Daten!E30=\"w\"),\"N1w\",IF(AND(ASV_Daten!A30=\"1b\",ASV_Daten!E30=\"m\"),\"N1m\",IF(AND(ASV_Daten!A30=\"2a\",ASV_Daten!E30=\"m\"),\"N2m\",IF(AND(ASV_Daten!A30=\"2a\",ASV_Daten!E30=\"w\"),\"N2w\",IF(AND(ASV_Daten!A30=\"2b\",ASV_Daten!E30=\"w\"),\"N2w\",IF(AND(ASV_Daten!A30=\"2b\",ASV_Daten!E30=\"m\"),\"N2m\",IF(AND(ASV_Daten!A30=\"3a\",ASV_Daten!E30=\"m\"),\"N3m\",IF(AND(ASV_Daten!A30=\"3a\",ASV_Daten!E30=\"w\"),\"N3w\",IF(AND(ASV_Daten!A30=\"3b\",ASV_Daten!E30=\"w\"),\"N3w\",IF(AND(ASV_Daten!A30=\"3b\",ASV_Daten!E30=\"m\"),\"N3m\",IF(AND(ASV_Daten!A30=\"4a\",ASV_Daten!E30=\"m\"),\"N4m\",IF(AND(ASV_Daten!A30=\"4a\",ASV_Daten!E30=\"w\"),\"N4w\",IF(AND(ASV_Daten!A30=\"4b\",ASV_Daten!E30=\"m\"),\"N4m\",IF(AND(ASV_Daten!A30=\"4b\",ASV_Daten!E30=\"w\"),\"N4w\"))))))))))))))))","v":false},"nix",null,{"$f":"VLOOKUP(\"1a\",A19:E20,5)","v":{"$error":"#N/A"}}]
[{"$f":"IF(ASV_Daten!A25=\"\",\"\",ASV_Daten!A25)","v":"5a"},{"$f":"IF(ASV_Daten!B25=\"\",\"\",ASV_Daten!B25)","v":"Djajo"},{"$f":"IF(ASV_Daten!C25=\"\",\"\",ASV_Daten!C25)","v":"Johann"},{"$f":"IF(ASV_Daten!D25=\"\",\"\",ASV_Daten!D25)","v":2011},{"$f":"IF(ASV_Daten!E25=\"\",\"\",ASV_Daten!E25)","v":"m"},"5am",{"$f":"IF(ASV_Daten!D31=\"\",\"\",$B$1-ASV_Daten!$D31)","v":11},{"$f":"G26&ASV_Daten!E31","v":"11m"},500,11.81,2.2000000000000002,11,{"$f":"IF(ASV_Daten!E31=\"w\",(((800/I26)-2.0232)/0.00647),(((1000/I26)-2.158)/0.006))","v":-26.333333333333318},{"$f":"IF(ASV_Daten!$E31=\"w\",(((50/(J26+0.24))-3.648)/0.0066),IF(ASV_Daten!$E31=\"M\",(((50/(J26+0.24))-3.79)/0.0069),0))","v":52.083709182752941},{"$f":"IF(ASV_Daten!$E31=\"w\",((SQRT(K26)-1.0935)/0.00208),IF(ASV_Daten!$E31=\"m\",((SQRT(K26)-1.15028)/0.00219),0))","v":152.03639151558568},{"$f":"IF(ASV_Daten!E31=\"w\",((SQRT(L26)-2.0232)/0.00874),IF(ASV_Daten!$E31=\"M\",((SQRT(L26)-2.8)/0.011),0))","v":46.96589003230909},251,"T",{"$f":"IF(AND(ASV_Daten!A31=\"1a\",ASV_Daten!E31=\"m\"),\"N1m\",IF(AND(ASV_Daten!A31=\"1a\",ASV_Daten!E31=\"w\"),\"N1w\",IF(AND(ASV_Daten!A31=\"1b\",ASV_Daten!E31=\"w\"),\"N1w\",IF(AND(ASV_Daten!A31=\"1b\",ASV_Daten!E31=\"m\"),\"N1m\",IF(AND(ASV_Daten!A31=\"2a\",ASV_Daten!E31=\"m\"),\"N2m\",IF(AND(ASV_Daten!A31=\"2a\",ASV_Daten!E31=\"w\"),\"N2w\",IF(AND(ASV_Daten!A31=\"2b\",ASV_Daten!E31=\"w\"),\"N2w\",IF(AND(ASV_Daten!A31=\"2b\",ASV_Daten!E31=\"m\"),\"N2m\",IF(AND(ASV_Daten!A31=\"3a\",ASV_Daten!E31=\"m\"),\"N3m\",IF(AND(ASV_Daten!A31=\"3a\",ASV_Daten!E31=\"w\"),\"N3w\",IF(AND(ASV_Daten!A31=\"3b\",ASV_Daten!E31=\"w\"),\"N3w\",IF(AND(ASV_Daten!A31=\"3b\",ASV_Daten!E31=\"m\"),\"N3m\",IF(AND(ASV_Daten!A31=\"4a\",ASV_Daten!E31=\"m\"),\"N4m\",IF(AND(ASV_Daten!A31=\"4a\",ASV_Daten!E31=\"w\"),\"N4w\",IF(AND(ASV_Daten!A31=\"4b\",ASV_Daten!E31=\"m\"),\"N4m\",IF(AND(ASV_Daten!A31=\"4b\",ASV_Daten!E31=\"w\"),\"N4w\"))))))))))))))))","v":false},"nix",null,{"$f":"VLOOKUP(\"1a\",A20:E20,5)","v":{"$error":"#N/A"}}]
[{"$f":"IF(ASV_Daten!A26=\"\",\"\",ASV_Daten!A26)","v":"5a"},{"$f":"IF(ASV_Daten!B26=\"\",\"\",ASV_Daten!B26)","v":"Hiller"},{"$f":"IF(ASV_Daten!C26=\"\",\"\",ASV_Daten!C26)","v":"Marco"},{"$f":"IF(ASV_Daten!D26=\"\",\"\",ASV_Daten!D26)","v":2011},{"$f":"IF(ASV_Daten!E26=\"\",\"\",ASV_Daten!E26)","v":"m"},"5am",{"$f":"IF(ASV_Daten!D34=\"\",\"\",$B$1-ASV_Daten!$D34)","v":10},{"$f":"G27&ASV_Daten!E34","v":"10m"},500,10.75,1.6,10,{"$f":"IF(ASV_Daten!E34=\"w\",(((800/I27)-2.0232)/0.00647),(((1000/I27)-2.158)/0.006))","v":-26.333333333333318},{"$f":"IF(ASV_Daten!$E34=\"w\",(((50/(J27+0.24))-3.648)/0.0066),IF(ASV_Daten!$E34=\"M\",(((50/(J27+0.24))-3.79)/0.0069),0))","v":110.0855850509686},{"$f":"IF(ASV_Daten!$E34=\"w\",((SQRT(K27)-1.0935)/0.00208),IF(ASV_Daten!$E34=\"m\",((SQRT(K27)-1.15028)/0.00219),0))","v":52.342951628927757},{"$f":"IF(ASV_Daten!E34=\"w\",((SQRT(L27)-2.0232)/0.00874),IF(ASV_Daten!$E34=\"M\",((SQRT(L27)-2.8)/0.011),0))","v":32.934332742579976},195,"T",{"$f":"IF(AND(ASV_Daten!A34=\"1a\",ASV_Daten!E34=\"m\"),\"N1m\",IF(AND(ASV_Daten!A34=\"1a\",ASV_Daten!E34=\"w\"),\"N1w\",IF(AND(ASV_Daten!A34=\"1b\",ASV_Daten!E34=\"w\"),\"N1w\",IF(AND(ASV_Daten!A34=\"1b\",ASV_Daten!E34=\"m\"),\"N1m\",IF(AND(ASV_Daten!A34=\"2a\",ASV_Daten!E34=\"m\"),\"N2m\",IF(AND(ASV_Daten!A34=\"2a\",ASV_Daten!E34=\"w\"),\"N2w\",IF(AND(ASV_Daten!A34=\"2b\",ASV_Daten!E34=\"w\"),\"N2w\",IF(AND(ASV_Daten!A34=\"2b\",ASV_Daten!E34=\"m\"),\"N2m\",IF(AND(ASV_Daten!A34=\"3a\",ASV_Daten!E34=\"m\"),\"N3m\",IF(AND(ASV_Daten!A34=\"3a\",ASV_Daten!E34=\"w\"),\"N3w\",IF(AND(ASV_Daten!A34=\"3b\",ASV_Daten!E34=\"w\"),\"N3w\",IF(AND(ASV_Daten!A34=\"3b\",ASV_Daten!E34=\"m\"),\"N3m\",IF(AND(ASV_Daten!A34=\"4a\",ASV_Daten!E34=\"m\"),\"N4m\",IF(AND(ASV_Daten!A34=\"4a\",ASV_Daten!E34=\"w\"),\"N4w\",IF(AND(ASV_Daten!A34=\"4b\",ASV_Daten!E34=\"m\"),\"N4m\",IF(AND(ASV_Daten!A34=\"4b\",ASV_Daten!E34=\"w\"),\"N4w\"))))))))))))))))","v":false},"nix"]
[{"$f":"IF(ASV_Daten!A27=\"\",\"\",ASV_Daten!A27)","v":"5a"},{"$f":"IF(ASV_Daten!B27=\"\",\"\",ASV_Daten!B27)","v":"Lex"},{"$f":"IF(ASV_Daten!C27=\"\",\"\",ASV_Daten!C27)","v":"Stefan"},{"$f":"IF(ASV_Daten!D27=\"\",\"\",ASV_Daten!D27)","v":2010},{"$f":"IF(ASV_Daten!E27=\"\",\"\",ASV_Daten!E27)","v":"m"},"5am",{"$f":"IF(ASV_Daten!D35=\"\",\"\",$B$1-ASV_Daten!$D35)","v":11},{"$f":"G28&ASV_Daten!E35","v":"11m"},500,9.9700000000000006,2.3199999999999998,9,{"$f":"IF(ASV_Daten!E35=\"w\",(((800/I28)-2.0232)/0.00647),(((1000/I28)-2.158)/0.006))","v":-26.333333333333318},{"$f":"IF(ASV_Daten!$E35=\"w\",(((50/(J28+0.24))-3.648)/0.0066),IF(ASV_Daten!$E35=\"M\",(((50/(J28+0.24))-3.79)/0.0069),0))","v":160.45791991369643},{"$f":"IF(ASV_Daten!$E35=\"w\",((SQRT(K28)-1.0935)/0.00208),IF(ASV_Daten!$E35=\"m\",((SQRT(K28)-1.15028)/0.00219),0))","v":170.26238409716052},{"$f":"IF(ASV_Daten!E35=\"w\",((SQRT(L28)-2.0232)/0.00874),IF(ASV_Daten!$E35=\"M\",((SQRT(L28)-2.8)/0.011),0))","v":18.181818181818198},349,"T",{"$f":"IF(AND(ASV_Daten!A35=\"1a\",ASV_Daten!E35=\"m\"),\"N1m\",IF(AND(ASV_Daten!A35=\"1a\",ASV_Daten!E35=\"w\"),\"N1w\",IF(AND(ASV_Daten!A35=\"1b\",ASV_Daten!E35=\"w\"),\"N1w\",IF(AND(ASV_Daten!A35=\"1b\",ASV_Daten!E35=\"m\"),\"N1m\",IF(AND(ASV_Daten!A35=\"2a\",ASV_Daten!E35=\"m\"),\"N2m\",IF(AND(ASV_Daten!A35=\"2a\",ASV_Daten!E35=\"w\"),\"N2w\",IF(AND(ASV_Daten!A35=\"2b\",ASV_Daten!E35=\"w\"),\"N2w\",IF(AND(ASV_Daten!A35=\"2b\",ASV_Daten!E35=\"m\"),\"N2m\",IF(AND(ASV_Daten!A35=\"3a\",ASV_Daten!E35=\"m\"),\"N3m\",IF(AND(ASV_Daten!A35=\"3a\",ASV_Daten!E35=\"w\"),\"N3w\",IF(AND(ASV_Daten!A35=\"3b\",ASV_Daten!E35=\"w\"),\"N3w\",IF(AND(ASV_Daten!A35=\"3b\",ASV_Daten!E35=\"m\"),\"N3m\",IF(AND(ASV_Daten!A35=\"4a\",ASV_Daten!E35=\"m\"),\"N4m\",IF(AND(ASV_Daten!A35=\"4a\",ASV_Daten!E35=\"w\"),\"N4w\",IF(AND(ASV_Daten!A35=\"4b\",ASV_Daten!E35=\"m\"),\"N4m\",IF(AND(ASV_Daten!A35=\"4b\",ASV_Daten!E35=\"w\"),\"N4w\"))))))))))))))))","v":false},"nix"]
[{"$f":"IF(ASV_Daten!A28=\"\",\"\",ASV_Daten!A28)","v":"5a"},{"$f":"IF(ASV_Daten!B28=\"\",\"\",ASV_Daten!B28)","v":"Mölders "},{"$f":"IF(ASV_Daten!C28=\"\",\"\",ASV_Daten!C28)","v":"Sascha"},{"$f":"IF(ASV_Daten!D28=\"\",\"\",ASV_Daten!D28)","v":2011},{"$f":"IF(ASV_Daten!E28=\"\",\"\",ASV_Daten!E28)","v":"m"},"5am",{"$f":"IF(ASV_Daten!D23=\"\",\"\",$B$1-ASV_Daten!$D23)","v":11},{"$f":"G29&ASV_Daten!E23","v":"11m"},500,10.28,2.2200000000000002,9.5,{"$f":"IF(ASV_Daten!E23=\"w\",(((800/I29)-2.0232)/0.00647),(((1000/I29)-2.158)/0.006))","v":-26.333333333333318},{"$f":"IF(ASV_Daten!$E23=\"w\",(((50/(J29+0.24))-3.648)/0.0066),IF(ASV_Daten!$E23=\"M\",(((50/(J29+0.24))-3.79)/0.0069),0))","v":139.54372623574145},{"$f":"IF(ASV_Daten!$E23=\"w\",((SQRT(K29)-1.0935)/0.00208),IF(ASV_Daten!$E23=\"m\",((SQRT(K29)-1.15028)/0.00219),0))","v":155.10796464617991},{"$f":"IF(ASV_Daten!E23=\"w\",((SQRT(L29)-2.0232)/0.00874),IF(ASV_Daten!$E23=\"M\",((SQRT(L29)-2.8)/0.011),0))","v":25.65518195313529},320,"T",{"$f":"IF(AND(ASV_Daten!A23=\"1a\",ASV_Daten!E23=\"m\"),\"N1m\",IF(AND(ASV_Daten!A23=\"1a\",ASV_Daten!E23=\"w\"),\"N1w\",IF(AND(ASV_Daten!A23=\"1b\",ASV_Daten!E23=\"w\"),\"N1w\",IF(AND(ASV_Daten!A23=\"1b\",ASV_Daten!E23=\"m\"),\"N1m\",IF(AND(ASV_Daten!A23=\"2a\",ASV_Daten!E23=\"m\"),\"N2m\",IF(AND(ASV_Daten!A23=\"2a\",ASV_Daten!E23=\"w\"),\"N2w\",IF(AND(ASV_Daten!A23=\"2b\",ASV_Daten!E23=\"w\"),\"N2w\",IF(AND(ASV_Daten!A23=\"2b\",ASV_Daten!E23=\"m\"),\"N2m\",IF(AND(ASV_Daten!A23=\"3a\",ASV_Daten!E23=\"m\"),\"N3m\",IF(AND(ASV_Daten!A23=\"3a\",ASV_Daten!E23=\"w\"),\"N3w\",IF(AND(ASV_Daten!A23=\"3b\",ASV_Daten!E23=\"w\"),\"N3w\",IF(AND(ASV_Daten!A23=\"3b\",ASV_Daten!E23=\"m\"),\"N3m\",IF(AND(ASV_Daten!A23=\"4a\",ASV_Daten!E23=\"m\"),\"N4m\",IF(AND(ASV_Daten!A23=\"4a\",ASV_Daten!E23=\"w\"),\"N4w\",IF(AND(ASV_Daten!A23=\"4b\",ASV_Daten!E23=\"m\"),\"N4m\",IF(AND(ASV_Daten!A23=\"4b\",ASV_Daten!E23=\"w\"),\"N4w\"))))))))))))))))","v":false},"nix"]
[{"$f":"IF(ASV_Daten!A29=\"\",\"\",ASV_Daten!A29)","v":"5a"},{"$f":"IF(ASV_Daten!B29=\"\",\"\",ASV_Daten!B29)","v":"Tallig"},{"$f":"IF(ASV_Daten!C29=\"\",\"\",ASV_Daten!C29)","v":"Erik"},{"$f":"IF(ASV_Daten!D29=\"\",\"\",ASV_Daten!D29)","v":2011},{"$f":"IF(ASV_Daten!E29=\"\",\"\",ASV_Daten!E29)","v":"m"},"5am",{"$f":"IF(ASV_Daten!D24=\"\",\"\",$B$1-ASV_Daten!$D24)","v":10},{"$f":"G30&ASV_Daten!E24","v":"10m"},500,10.53,2.75,16.5,{"$f":"IF(ASV_Daten!E24=\"w\",(((800/I30)-2.0232)/0.00647),(((1000/I30)-2.158)/0.006))","v":-26.333333333333318},{"$f":"IF(ASV_Daten!$E24=\"w\",(((50/(J30+0.24))-3.648)/0.0066),IF(ASV_Daten!$E24=\"M\",(((50/(J30+0.24))-3.79)/0.0069),0))","v":123.55442520151257},{"$f":"IF(ASV_Daten!$E24=\"w\",((SQRT(K30)-1.0935)/0.00208),IF(ASV_Daten!$E24=\"m\",((SQRT(K30)-1.15028)/0.00219),0))","v":231.97826263821915},{"$f":"IF(ASV_Daten!E24=\"w\",((SQRT(L30)-2.0232)/0.00874),IF(ASV_Daten!$E24=\"M\",((SQRT(L30)-2.8)/0.011),0))","v":114.72901839254369},470,"T",{"$f":"IF(AND(ASV_Daten!A24=\"1a\",ASV_Daten!E24=\"m\"),\"N1m\",IF(AND(ASV_Daten!A24=\"1a\",ASV_Daten!E24=\"w\"),\"N1w\",IF(AND(ASV_Daten!A24=\"1b\",ASV_Daten!E24=\"w\"),\"N1w\",IF(AND(ASV_Daten!A24=\"1b\",ASV_Daten!E24=\"m\"),\"N1m\",IF(AND(ASV_Daten!A24=\"2a\",ASV_Daten!E24=\"m\"),\"N2m\",IF(AND(ASV_Daten!A24=\"2a\",ASV_Daten!E24=\"w\"),\"N2w\",IF(AND(ASV_Daten!A24=\"2b\",ASV_Daten!E24=\"w\"),\"N2w\",IF(AND(ASV_Daten!A24=\"2b\",ASV_Daten!E24=\"m\"),\"N2m\",IF(AND(ASV_Daten!A24=\"3a\",ASV_Daten!E24=\"m\"),\"N3m\",IF(AND(ASV_Daten!A24=\"3a\",ASV_Daten!E24=\"w\"),\"N3w\",IF(AND(ASV_Daten!A24=\"3b\",ASV_Daten!E24=\"w\"),\"N3w\",IF(AND(ASV_Daten!A24=\"3b\",ASV_Daten!E24=\"m\"),\"N3m\",IF(AND(ASV_Daten!A24=\"4a\",ASV_Daten!E24=\"m\"),\"N4m\",IF(AND(ASV_Daten!A24=\"4a\",ASV_Daten!E24=\"w\"),\"N4w\",IF(AND(ASV_Daten!A24=\"4b\",ASV_Daten!E24=\"m\"),\"N4m\",IF(AND(ASV_Daten!A24=\"4b\",ASV_Daten!E24=\"w\"),\"N4w\"))))))))))))))))","v":false},"nix"]
[{"$f":"IF(ASV_Daten!A30=\"\",\"\",ASV_Daten!A30)","v":"5b"},{"$f":"IF(ASV_Daten!B30=\"\",\"\",ASV_Daten!B30)","v":"Belkner"},{"$f":"IF(ASV_Daten!C30=\"\",\"\",ASV_Daten!C30)","v":"Jerome"},{"$f":"IF(ASV_Daten!D30=\"\",\"\",ASV_Daten!D30)","v":2010},{"$f":"IF(ASV_Daten!E30=\"\",\"\",ASV_Daten!E30)","v":"m"},"5bm",{"$f":"IF(ASV_Daten!D25=\"\",\"\",$B$1-ASV_Daten!$D25)","v":10},{"$f":"G31&ASV_Daten!E25","v":"10m"},500,10.48,2.35,9,{"$f":"IF(ASV_Daten!E25=\"w\",(((800/I31)-2.0232)/0.00647),(((1000/I31)-2.158)/0.006))","v":-26.333333333333318},{"$f":"IF(ASV_Daten!$E25=\"w\",(((50/(J31+0.24))-3.648)/0.0066),IF(ASV_Daten!$E25=\"M\",(((50/(J31+0.24))-3.79)/0.0069),0))","v":126.69262383733496},{"$f":"IF(ASV_Daten!$E25=\"w\",((SQRT(K31)-1.0935)/0.00208),IF(ASV_Daten!$E25=\"m\",((SQRT(K31)-1.15028)/0.00219),0))","v":174.7447359249266},{"$f":"IF(ASV_Daten!E25=\"w\",((SQRT(L31)-2.0232)/0.00874),IF(ASV_Daten!$E25=\"M\",((SQRT(L31)-2.8)/0.011),0))","v":18.181818181818198},320,"T",{"$f":"IF(AND(ASV_Daten!A25=\"1a\",ASV_Daten!E25=\"m\"),\"N1m\",IF(AND(ASV_Daten!A25=\"1a\",ASV_Daten!E25=\"w\"),\"N1w\",IF(AND(ASV_Daten!A25=\"1b\",ASV_Daten!E25=\"w\"),\"N1w\",IF(AND(ASV_Daten!A25=\"1b\",ASV_Daten!E25=\"m\"),\"N1m\",IF(AND(ASV_Daten!A25=\"2a\",ASV_Daten!E25=\"m\"),\"N2m\",IF(AND(ASV_Daten!A25=\"2a\",ASV_Daten!E25=\"w\"),\"N2w\",IF(AND(ASV_Daten!A25=\"2b\",ASV_Daten!E25=\"w\"),\"N2w\",IF(AND(ASV_Daten!A25=\"2b\",ASV_Daten!E25=\"m\"),\"N2m\",IF(AND(ASV_Daten!A25=\"3a\",ASV_Daten!E25=\"m\"),\"N3m\",IF(AND(ASV_Daten!A25=\"3a\",ASV_Daten!E25=\"w\"),\"N3w\",IF(AND(ASV_Daten!A25=\"3b\",ASV_Daten!E25=\"w\"),\"N3w\",IF(AND(ASV_Daten!A25=\"3b\",ASV_Daten!E25=\"m\"),\"N3m\",IF(AND(ASV_Daten!A25=\"4a\",ASV_Daten!E25=\"m\"),\"N4m\",IF(AND(ASV_Daten!A25=\"4a\",ASV_Daten!E25=\"w\"),\"N4w\",IF(AND(ASV_Daten!A25=\"4b\",ASV_Daten!E25=\"m\"),\"N4m\",IF(AND(ASV_Daten!A25=\"4b\",ASV_Daten!E25=\"w\"),\"N4w\"))))))))))))))))","v":false},"nix"]
[{"$f":"IF(ASV_Daten!A31=\"\",\"\",ASV_Daten!A31)","v":"5b"},{"$f":"IF(ASV_Daten!B31=\"\",\"\",ASV_Daten!B31)","v":"Belkahia"},{"$f":"IF(ASV_Daten!C31=\"\",\"\",ASV_Daten!C31)","v":"Semi"},{"$f":"IF(ASV_Daten!D31=\"\",\"\",ASV_Daten!D31)","v":2010},{"$f":"IF(ASV_Daten!E31=\"\",\"\",ASV_Daten!E31)","v":"m"},"5bm",{"$f":"IF(ASV_Daten!D26=\"\",\"\",$B$1-ASV_Daten!$D26)","v":10},{"$f":"G32&ASV_Daten!E26","v":"10m"},500,9.75,2.52,6,{"$f":"IF(ASV_Daten!E26=\"w\",(((800/I32)-2.0232)/0.00647),(((1000/I32)-2.158)/0.006))","v":-26.333333333333318},{"$f":"IF(ASV_Daten!$E26=\"w\",(((50/(J32+0.24))-3.648)/0.0066),IF(ASV_Daten!$E26=\"M\",(((50/(J32+0.24))-3.79)/0.0069),0))","v":176.08768188478334},{"$f":"IF(ASV_Daten!$E26=\"w\",((SQRT(K32)-1.0935)/0.00208),IF(ASV_Daten!$E26=\"m\",((SQRT(K32)-1.15028)/0.00219),0))","v":199.62136376198831},{"$f":"IF(ASV_Daten!E26=\"w\",((SQRT(L32)-2.0232)/0.00874),IF(ASV_Daten!$E26=\"M\",((SQRT(L32)-2.8)/0.011),0))","v":-31.864568837892907},349,"T",{"$f":"IF(AND(ASV_Daten!A26=\"1a\",ASV_Daten!E26=\"m\"),\"N1m\",IF(AND(ASV_Daten!A26=\"1a\",ASV_Daten!E26=\"w\"),\"N1w\",IF(AND(ASV_Daten!A26=\"1b\",ASV_Daten!E26=\"w\"),\"N1w\",IF(AND(ASV_Daten!A26=\"1b\",ASV_Daten!E26=\"m\"),\"N1m\",IF(AND(ASV_Daten!A26=\"2a\",ASV_Daten!E26=\"m\"),\"N2m\",IF(AND(ASV_Daten!A26=\"2a\",ASV_Daten!E26=\"w\"),\"N2w\",IF(AND(ASV_Daten!A26=\"2b\",ASV_Daten!E26=\"w\"),\"N2w\",IF(AND(ASV_Daten!A26=\"2b\",ASV_Daten!E26=\"m\"),\"N2m\",IF(AND(ASV_Daten!A26=\"3a\",ASV_Daten!E26=\"m\"),\"N3m\",IF(AND(ASV_Daten!A26=\"3a\",ASV_Daten!E26=\"w\"),\"N3w\",IF(AND(ASV_Daten!A26=\"3b\",ASV_Daten!E26=\"w\"),\"N3w\",IF(AND(ASV_Daten!A26=\"3b\",ASV_Daten!E26=\"m\"),\"N3m\",IF(AND(ASV_Daten!A26=\"4a\",ASV_Daten!E26=\"m\"),\"N4m\",IF(AND(ASV_Daten!A26=\"4a\",ASV_Daten!E26=\"w\"),\"N4w\",IF(AND(ASV_Daten!A26=\"4b\",ASV_Daten!E26=\"m\"),\"N4m\",IF(AND(ASV_Daten!A26=\"4b\",ASV_Daten!E26=\"w\"),\"N4w\"))))))))))))))))","v":false},"nix"]
[{"$f":"IF(ASV_Daten!A32=\"\",\"\",ASV_Daten!A32)","v":"5b"},{"$f":"IF(ASV_Daten!B32=\"\",\"\",ASV_Daten!B32)","v":"Belkner"},{"$f":"IF(ASV_Daten!C32=\"\",\"\",ASV_Daten!C32)","v":"Jerome"},{"$f":"IF(ASV_Daten!D32=\"\",\"\",ASV_Daten!D32)","v":2010},{"$f":"IF(ASV_Daten!E32=\"\",\"\",ASV_Daten!E32)","v":"m"},"5bm",{"$f":"IF(ASV_Daten!D28=\"\",\"\",$B$1-ASV_Daten!$D28)","v":10},{"$f":"G33&ASV_Daten!E28","v":"10m"},500,9.3800000000000008,2.65,7,{"$f":"IF(ASV_Daten!E28=\"w\",(((800/I33)-2.0232)/0.00647),(((1000/I33)-2.158)/0.006))","v":-26.333333333333318},{"$f":"IF(ASV_Daten!$E28=\"w\",(((50/(J33+0.24))-3.648)/0.0066),IF(ASV_Daten!$E28=\"M\",(((50/(J33+0.24))-3.79)/0.0069),0))","v":203.9862605079995},{"$f":"IF(ASV_Daten!$E28=\"w\",((SQRT(K33)-1.0935)/0.00208),IF(ASV_Daten!$E28=\"m\",((SQRT(K33)-1.15028)/0.00219),0))","v":218.08313224199568},{"$f":"IF(ASV_Daten!E28=\"w\",((SQRT(L33)-2.0232)/0.00874),IF(ASV_Daten!$E28=\"M\",((SQRT(L33)-2.8)/0.011),0))","v":-14.022608085037191},408,"T",{"$f":"IF(AND(ASV_Daten!A28=\"1a\",ASV_Daten!E28=\"m\"),\"N1m\",IF(AND(ASV_Daten!A28=\"1a\",ASV_Daten!E28=\"w\"),\"N1w\",IF(AND(ASV_Daten!A28=\"1b\",ASV_Daten!E28=\"w\"),\"N1w\",IF(AND(ASV_Daten!A28=\"1b\",ASV_Daten!E28=\"m\"),\"N1m\",IF(AND(ASV_Daten!A28=\"2a\",ASV_Daten!E28=\"m\"),\"N2m\",IF(AND(ASV_Daten!A28=\"2a\",ASV_Daten!E28=\"w\"),\"N2w\",IF(AND(ASV_Daten!A28=\"2b\",ASV_Daten!E28=\"w\"),\"N2w\",IF(AND(ASV_Daten!A28=\"2b\",ASV_Daten!E28=\"m\"),\"N2m\",IF(AND(ASV_Daten!A28=\"3a\",ASV_Daten!E28=\"m\"),\"N3m\",IF(AND(ASV_Daten!A28=\"3a\",ASV_Daten!E28=\"w\"),\"N3w\",IF(AND(ASV_Daten!A28=\"3b\",ASV_Daten!E28=\"w\"),\"N3w\",IF(AND(ASV_Daten!A28=\"3b\",ASV_Daten!E28=\"m\"),\"N3m\",IF(AND(ASV_Daten!A28=\"4a\",ASV_Daten!E28=\"m\"),\"N4m\",IF(AND(ASV_Daten!A28=\"4a\",ASV_Daten!E28=\"w\"),\"N4w\",IF(AND(ASV_Daten!A28=\"4b\",ASV_Daten!E28=\"m\"),\"N4m\",IF(AND(ASV_Daten!A28=\"4b\",ASV_Daten!E28=\"w\"),\"N4w\"))))))))))))))))","v":false},"nix"]
[{"$f":"IF(ASV_Daten!A33=\"\",\"\",ASV_Daten!A33)","v":"5b"},{"$f":"IF(ASV_Daten!B33=\"\",\"\",ASV_Daten!B33)","v":"Zeppelin"},{"$f":"IF(ASV_Daten!C33=\"\",\"\",ASV_Daten!C33)","v":"Leni"},{"$f":"IF(ASV_Daten!D33=\"\",\"\",ASV_Daten!D33)","v":2011},{"$f":"IF(ASV_Daten!E33=\"\",\"\",ASV_Daten!E33)","v":"w"},"5bw",{"$f":"IF(ASV_Daten!D29=\"\",\"\",$B$1-ASV_Daten!$D29)","v":10},{"$f":"G34&ASV_Daten!E29","v":"10m"},500,10.130000000000001,2.4,13,{"$f":"IF(ASV_Daten!E29=\"w\",(((800/I34)-2.0232)/0.00647),(((1000/I34)-2.158)/0.006))","v":-26.333333333333318},{"$f":"IF(ASV_Daten!$E29=\"w\",(((50/(J34+0.24))-3.648)/0.0066),IF(ASV_Daten!$E29=\"M\",(((50/(J34+0.24))-3.79)/0.0069),0))","v":149.50735818204683},{"$f":"IF(ASV_Daten!$E29=\"w\",((SQRT(K34)-1.0935)/0.00208),IF(ASV_Daten!$E29=\"m\",((SQRT(K34)-1.15028)/0.00219),0))","v":182.15220935295289},{"$f":"IF(ASV_Daten!E29=\"w\",((SQRT(L34)-2.0232)/0.00874),IF(ASV_Daten!$E29=\"M\",((SQRT(L34)-2.8)/0.011),0))","v":73.231934133089936},405,"T",{"$f":"IF(AND(ASV_Daten!A29=\"1a\",ASV_Daten!E29=\"m\"),\"N1m\",IF(AND(ASV_Daten!A29=\"1a\",ASV_Daten!E29=\"w\"),\"N1w\",IF(AND(ASV_Daten!A29=\"1b\",ASV_Daten!E29=\"w\"),\"N1w\",IF(AND(ASV_Daten!A29=\"1b\",ASV_Daten!E29=\"m\"),\"N1m\",IF(AND(ASV_Daten!A29=\"2a\",ASV_Daten!E29=\"m\"),\"N2m\",IF(AND(ASV_Daten!A29=\"2a\",ASV_Daten!E29=\"w\"),\"N2w\",IF(AND(ASV_Daten!A29=\"2b\",ASV_Daten!E29=\"w\"),\"N2w\",IF(AND(ASV_Daten!A29=\"2b\",ASV_Daten!E29=\"m\"),\"N2m\",IF(AND(ASV_Daten!A29=\"3a\",ASV_Daten!E29=\"m\"),\"N3m\",IF(AND(ASV_Daten!A29=\"3a\",ASV_Daten!E29=\"w\"),\"N3w\",IF(AND(ASV_Daten!A29=\"3b\",ASV_Daten!E29=\"w\"),\"N3w\",IF(AND(ASV_Daten!A29=\"3b\",ASV_Daten!E29=\"m\"),\"N3m\",IF(AND(ASV_Daten!A29=\"4a\",ASV_Daten!E29=\"m\"),\"N4m\",IF(AND(ASV_Daten!A29=\"4a\",ASV_Daten!E29=\"w\"),\"N4w\",IF(AND(ASV_Daten!A29=\"4b\",ASV_Daten!E29=\"m\"),\"N4m\",IF(AND(ASV_Daten!A29=\"4b\",ASV_Daten!E29=\"w\"),\"N4w\"))))))))))))))))","v":false},"nix"]
[{"$f":"IF(ASV_Daten!A34=\"\",\"\",ASV_Daten!A34)","v":"5b"},{"$f":"IF(ASV_Daten!B34=\"\",\"\",ASV_Daten!B34)","v":"Kallote"},{"$f":"IF(ASV_Daten!C34=\"\",\"\",ASV_Daten!C34)","v":"Marus"},{"$f":"IF(ASV_Daten!D34=\"\",\"\",ASV_Daten!D34)","v":2011},{"$f":"IF(ASV_Daten!E34=\"\",\"\",ASV_Daten!E34)","v":"m"},"5bm",{"$f":"IF(ASV_Daten!D32=\"\",\"\",$B$1-ASV_Daten!$D32)","v":11},{"$f":"G35&ASV_Daten!E32","v":"11m"},500,10.53,2.0299999999999998,12.5,{"$f":"IF(ASV_Daten!E32=\"w\",(((800/I35)-2.0232)/0.00647),(((1000/I35)-2.158)/0.006))","v":-26.333333333333318},{"$f":"IF(ASV_Daten!$E32=\"w\",(((50/(J35+0.24))-3.648)/0.0066),IF(ASV_Daten!$E32=\"M\",(((50/(J35+0.24))-3.79)/0.0069),0))","v":123.55442520151257},{"$f":"IF(ASV_Daten!$E32=\"w\",((SQRT(K35)-1.0935)/0.00208),IF(ASV_Daten!$E32=\"m\",((SQRT(K35)-1.15028)/0.00219),0))","v":125.34277848287702},{"$f":"IF(ASV_Daten!E32=\"w\",((SQRT(L35)-2.0232)/0.00874),IF(ASV_Daten!$E32=\"M\",((SQRT(L35)-2.8)/0.011),0))","v":66.866718721157994},{"$f":"ROUND((SUM(M35:P35)-MIN(M35:P35)),0)","v":316},{"$f":"IF(H35=\"7w\",VLOOKUP(Q35,weiblich8,2),IF(H35=\"7m\",VLOOKUP(Q35,männlich8,2),IF(H35=\"8w\",VLOOKUP(Q35,weiblich8,2),IF(H35=\"8m\",VLOOKUP(Q35,männlich8,2),IF(H35=\"9w\",VLOOKUP(Q35,weiblich9,2),IF(H35=\"9m\",VLOOKUP(Q35,männlich9,2),IF(H35=\"10w\",VLOOKUP(Q35,weiblich10,2),IF(H35=\"10m\",VLOOKUP(Q35,männlich10,2),IF(H35=\"11w\",VLOOKUP(Q35,weiblich11,2),IF(H35=\"11m\",VLOOKUP(Q35,männlich11,2),IF(H35=\"12w\",VLOOKUP(Q35,weiblich12,2),IF(H35=\"12m\",VLOOKUP(Q35,männlich12,2),\"H\"))))))))))))","v":"T"},{"$f":"IF(AND(ASV_Daten!A32=\"1a\",ASV_Daten!E32=\"m\"),\"N1m\",IF(AND(ASV_Daten!A32=\"1a\",ASV_Daten!E32=\"w\"),\"N1w\",IF(AND(ASV_Daten!A32=\"1b\",ASV_Daten!E32=\"w\"),\"N1w\",IF(AND(ASV_Daten!A32=\"1b\",ASV_Daten!E32=\"m\"),\"N1m\",IF(AND(ASV_Daten!A32=\"2a\",ASV_Daten!E32=\"m\"),\"N2m\",IF(AND(ASV_Daten!A32=\"2a\",ASV_Daten!E32=\"w\"),\"N2w\",IF(AND(ASV_Daten!A32=\"2b\",ASV_Daten!E32=\"w\"),\"N2w\",IF(AND(ASV_Daten!A32=\"2b\",ASV_Daten!E32=\"m\"),\"N2m\",IF(AND(ASV_Daten!A32=\"3a\",ASV_Daten!E32=\"m\"),\"N3m\",IF(AND(ASV_Daten!A32=\"3a\",ASV_Daten!E32=\"w\"),\"N3w\",IF(AND(ASV_Daten!A32=\"3b\",ASV_Daten!E32=\"w\"),\"N3w\",IF(AND(ASV_Daten!A32=\"3b\",ASV_Daten!E32=\"m\"),\"N3m\",IF(AND(ASV_Daten!A32=\"4a\",ASV_Daten!E32=\"m\"),\"N4m\",IF(AND(ASV_Daten!A32=\"4a\",ASV_Daten!E32=\"w\"),\"N4w\",IF(AND(ASV_Daten!A32=\"4b\",ASV_Daten!E32=\"m\"),\"N4m\",IF(AND(ASV_Daten!A32=\"4b\",ASV_Daten!E32=\"w\"),\"N4w\"))))))))))))))))","v":false},{"$f":"IF(S35=\"n1m\",VLOOKUP(Q35,N1m,2),IF(S35=\"N1w\",VLOOKUP(Q35,N1w,2),IF(S35=\"N2m\",VLOOKUP(Q35,n2m,2),IF(S35=\"N2w\",VLOOKUP(Q35,n2w,2),IF(S35=\"N3w\",VLOOKUP(Q35,n3w,2),IF(S35=\"N3m\",VLOOKUP(Q35,n3m,2),IF(S35=\"N4w\",VLOOKUP(Q35,n4w,2),IF(S35=\"N4m\",VLOOKUP(Q35,n4m,2),\"nix\"))))))))","v":"nix"}]
[{"$f":"IF(ASV_Daten!A35=\"\",\"\",ASV_Daten!A35)","v":"5b"},{"$f":"IF(ASV_Daten!B35=\"\",\"\",ASV_Daten!B35)","v":"Hund"},{"$f":"IF(ASV_Daten!C35=\"\",\"\",ASV_Daten!C35)","v":"Kurt"},{"$f":"IF(ASV_Daten!D35=\"\",\"\",ASV_Daten!D35)","v":2010},{"$f":"IF(ASV_Daten!E35=\"\",\"\",ASV_Daten!E35)","v":"m"},"5bm",{"$f":"IF(ASV_Daten!D33=\"\",\"\",$B$1-ASV_Daten!$D33)","v":10},{"$f":"G36&ASV_Daten!E33","v":"10w"},500,10.97,2.36,11.5,{"$f":"IF(ASV_Daten!E33=\"w\",(((800/I36)-2.0232)/0.00647),(((1000/I36)-2.158)/0.006))","v":-65.409582689335394},{"$f":"IF(ASV_Daten!$E33=\"w\",(((50/(J36+0.24))-3.648)/0.0066),IF(ASV_Daten!$E33=\"M\",(((50/(J36+0.24))-3.79)/0.0069),0))","v":123.07625767037004},{"$f":"IF(ASV_Daten!$E33=\"w\",((SQRT(K36)-1.0935)/0.00208),IF(ASV_Daten!$E33=\"m\",((SQRT(K36)-1.15028)/0.00219),0))","v":212.85055267967394},{"$f":"IF(ASV_Daten!E33=\"w\",((SQRT(L36)-2.0232)/0.00874),IF(ASV_Daten!$E33=\"M\",((SQRT(L36)-2.8)/0.011),0))","v":156.51773358840205},492,"T",{"$f":"IF(AND(ASV_Daten!A33=\"1a\",ASV_Daten!E33=\"m\"),\"N1m\",IF(AND(ASV_Daten!A33=\"1a\",ASV_Daten!E33=\"w\"),\"N1w\",IF(AND(ASV_Daten!A33=\"1b\",ASV_Daten!E33=\"w\"),\"N1w\",IF(AND(ASV_Daten!A33=\"1b\",ASV_Daten!E33=\"m\"),\"N1m\",IF(AND(ASV_Daten!A33=\"2a\",ASV_Daten!E33=\"m\"),\"N2m\",IF(AND(ASV_Daten!A33=\"2a\",ASV_Daten!E33=\"w\"),\"N2w\",IF(AND(ASV_Daten!A33=\"2b\",ASV_Daten!E33=\"w\"),\"N2w\",IF(AND(ASV_Daten!A33=\"2b\",ASV_Daten!E33=\"m\"),\"N2m\",IF(AND(ASV_Daten!A33=\"3a\",ASV_Daten!E33=\"m\"),\"N3m\",IF(AND(ASV_Daten!A33=\"3a\",ASV_Daten!E33=\"w\"),\"N3w\",IF(AND(ASV_Daten!A33=\"3b\",ASV_Daten!E33=\"w\"),\"N3w\",IF(AND(ASV_Daten!A33=\"3b\",ASV_Daten!E33=\"m\"),\"N3m\",IF(AND(ASV_Daten!A33=\"4a\",ASV_Daten!E33=\"m\"),\"N4m\",IF(AND(ASV_Daten!A33=\"4a\",ASV_Daten!E33=\"w\"),\"N4w\",IF(AND(ASV_Daten!A33=\"4b\",ASV_Daten!E33=\"m\"),\"N4m\",IF(AND(ASV_Daten!A33=\"4b\",ASV_Daten!E33=\"w\"),\"N4w\"))))))))))))))))","v":false},"nix"]
[{"$f":"IF(ASV_Daten!A36=\"\",\"\",ASV_Daten!A36)","v":"5b"},{"$f":"IF(ASV_Daten!B36=\"\",\"\",ASV_Daten!B36)","v":"Penara"},{"$f":"IF(ASV_Daten!C36=\"\",\"\",ASV_Daten!C36)","v":"Horst"},{"$f":"IF(ASV_Daten!D36=\"\",\"\",ASV_Daten!D36)","v":2010},{"$f":"IF(ASV_Daten!E36=\"\",\"\",ASV_Daten!E36)","v":"m"},"5bm",{"$f":"IF(ASV_Daten!D36=\"\",\"\",$B$1-ASV_Daten!$D36)","v":11},{"$f":"G37&ASV_Daten!E36","v":"11m"},500,10.029999999999999,2,14,{"$f":"IF(ASV_Daten!E36=\"w\",(((800/I37)-2.0232)/0.00647),(((1000/I37)-2.158)/0.006))","v":-26.333333333333318},{"$f":"IF(ASV_Daten!$E36=\"w\",(((50/(J37+0.24))-3.648)/0.0066),IF(ASV_Daten!$E36=\"M\",(((50/(J37+0.24))-3.79)/0.0069),0))","v":156.31147425313634},{"$f":"IF(ASV_Daten!$E36=\"w\",((SQRT(K37)-1.0935)/0.00208),IF(ASV_Daten!$E36=\"m\",((SQRT(K37)-1.15028)/0.00219),0))","v":120.51760838954117},{"$f":"IF(ASV_Daten!E36=\"w\",((SQRT(L37)-2.0232)/0.00874),IF(ASV_Daten!$E36=\"M\",((SQRT(L37)-2.8)/0.011),0))","v":85.605216979449239},362,"T",{"$f":"IF(AND(ASV_Daten!A36=\"1a\",ASV_Daten!E36=\"m\"),\"N1m\",IF(AND(ASV_Daten!A36=\"1a\",ASV_Daten!E36=\"w\"),\"N1w\",IF(AND(ASV_Daten!A36=\"1b\",ASV_Daten!E36=\"w\"),\"N1w\",IF(AND(ASV_Daten!A36=\"1b\",ASV_Daten!E36=\"m\"),\"N1m\",IF(AND(ASV_Daten!A36=\"2a\",ASV_Daten!E36=\"m\"),\"N2m\",IF(AND(ASV_Daten!A36=\"2a\",ASV_Daten!E36=\"w\"),\"N2w\",IF(AND(ASV_Daten!A36=\"2b\",ASV_Daten!E36=\"w\"),\"N2w\",IF(AND(ASV_Daten!A36=\"2b\",ASV_Daten!E36=\"m\"),\"N2m\",IF(AND(ASV_Daten!A36=\"3a\",ASV_Daten!E36=\"m\"),\"N3m\",IF(AND(ASV_Daten!A36=\"3a\",ASV_Daten!E36=\"w\"),\"N3w\",IF(AND(ASV_Daten!A36=\"3b\",ASV_Daten!E36=\"w\"),\"N3w\",IF(AND(ASV_Daten!A36=\"3b\",ASV_Daten!E36=\"m\"),\"N3m\",IF(AND(ASV_Daten!A36=\"4a\",ASV_Daten!E36=\"m\"),\"N4m\",IF(AND(ASV_Daten!A36=\"4a\",ASV_Daten!E36=\"w\"),\"N4w\",IF(AND(ASV_Daten!A36=\"4b\",ASV_Daten!E36=\"m\"),\"N4m\",IF(AND(ASV_Daten!A36=\"4b\",ASV_Daten!E36=\"w\"),\"N4w\"))))))))))))))))","v":false},"nix"]
[{"$f":"IF(ASV_Daten!A37=\"\",\"\",ASV_Daten!A37)","v":"5b"},{"$f":"IF(ASV_Daten!B37=\"\",\"\",ASV_Daten!B37)","v":"Rieser"},{"$f":"IF(ASV_Daten!C37=\"\",\"\",ASV_Daten!C37)","v":"Jennifer"},{"$f":"IF(ASV_Daten!D37=\"\",\"\",ASV_Daten!D37)","v":2010},{"$f":"IF(ASV_Daten!E37=\"\",\"\",ASV_Daten!E37)","v":"w"},"5bw",{"$f":"IF(ASV_Daten!D38=\"\",\"\",$B$1-ASV_Daten!$D38)","v":11},{"$f":"G38&ASV_Daten!E38","v":"11w"},500,9.6199999999999992,2.15,11.5,{"$f":"IF(ASV_Daten!E38=\"w\",(((800/I38)-2.0232)/0.00647),(((1000/I38)-2.158)/0.006))","v":-65.409582689335394},{"$f":"IF(ASV_Daten!$E38=\"w\",(((50/(J38+0.24))-3.648)/0.0066),IF(ASV_Daten!$E38=\"M\",(((50/(J38+0.24))-3.79)/0.0069),0))","v":215.60513860716702},{"$f":"IF(ASV_Daten!$E38=\"w\",((SQRT(K38)-1.0935)/0.00208),IF(ASV_Daten!$E38=\"m\",((SQRT(K38)-1.15028)/0.00219),0))","v":179.22491820265296},{"$f":"IF(ASV_Daten!E38=\"w\",((SQRT(L38)-2.0232)/0.00874),IF(ASV_Daten!$E38=\"M\",((SQRT(L38)-2.8)/0.011),0))","v":156.51773358840205},551,"T",{"$f":"IF(AND(ASV_Daten!A38=\"1a\",ASV_Daten!E38=\"m\"),\"N1m\",IF(AND(ASV_Daten!A38=\"1a\",ASV_Daten!E38=\"w\"),\"N1w\",IF(AND(ASV_Daten!A38=\"1b\",ASV_Daten!E38=\"w\"),\"N1w\",IF(AND(ASV_Daten!A38=\"1b\",ASV_Daten!E38=\"m\"),\"N1m\",IF(AND(ASV_Daten!A38=\"2a\",ASV_Daten!E38=\"m\"),\"N2m\",IF(AND(ASV_Daten!A38=\"2a\",ASV_Daten!E38=\"w\"),\"N2w\",IF(AND(ASV_Daten!A38=\"2b\",ASV_Daten!E38=\"w\"),\"N2w\",IF(AND(ASV_Daten!A38=\"2b\",ASV_Daten!E38=\"m\"),\"N2m\",IF(AND(ASV_Daten!A38=\"3a\",ASV_Daten!E38=\"m\"),\"N3m\",IF(AND(ASV_Daten!A38=\"3a\",ASV_Daten!E38=\"w\"),\"N3w\",IF(AND(ASV_Daten!A38=\"3b\",ASV_Daten!E38=\"w\"),\"N3w\",IF(AND(ASV_Daten!A38=\"3b\",ASV_Daten!E38=\"m\"),\"N3m\",IF(AND(ASV_Daten!A38=\"4a\",ASV_Daten!E38=\"m\"),\"N4m\",IF(AND(ASV_Daten!A38=\"4a\",ASV_Daten!E38=\"w\"),\"N4w\",IF(AND(ASV_Daten!A38=\"4b\",ASV_Daten!E38=\"m\"),\"N4m\",IF(AND(ASV_Daten!A38=\"4b\",ASV_Daten!E38=\"w\"),\"N4w\"))))))))))))))))","v":false},"nix"]
[{"$f":"IF(ASV_Daten!A38=\"\",\"\",ASV_Daten!A38)","v":"5b"},{"$f":"IF(ASV_Daten!B38=\"\",\"\",ASV_Daten!B38)","v":"Schoning"},{"$f":"IF(ASV_Daten!C38=\"\",\"\",ASV_Daten!C38)","v":"Daniela"},{"$f":"IF(ASV_Daten!D38=\"\",\"\",ASV_Daten!D38)","v":2010},{"$f":"IF(ASV_Daten!E38=\"\",\"\",ASV_Daten!E38)","v":"w"},"5bw",{"$f":"IF(ASV_Daten!D39=\"\",\"\",$B$1-ASV_Daten!$D39)","v":11},{"$f":"G39&ASV_Daten!E39","v":"11w"},500,11.56,2.1,10,{"$f":"IF(ASV_Daten!E39=\"w\",(((800/I39)-2.0232)/0.00647),(((1000/I39)-2.158)/0.006))","v":-65.409582689335394},{"$f":"IF(ASV_Daten!$E39=\"w\",(((50/(J39+0.24))-3.648)/0.0066),IF(ASV_Daten!$E39=\"M\",(((50/(J39+0.24))-3.79)/0.0069),0))","v":89.286081150487817},{"$f":"IF(ASV_Daten!$E39=\"w\",((SQRT(K39)-1.0935)/0.00208),IF(ASV_Daten!$E39=\"m\",((SQRT(K39)-1.15028)/0.00219),0))","v":170.97965125910773},{"$f":"IF(ASV_Daten!E39=\"w\",((SQRT(L39)-2.0232)/0.00874),IF(ASV_Daten!$E39=\"M\",((SQRT(L39)-2.8)/0.011),0))","v":130.32925173551251},391,"T",{"$f":"IF(AND(ASV_Daten!A39=\"1a\",ASV_Daten!E39=\"m\"),\"N1m\",IF(AND(ASV_Daten!A39=\"1a\",ASV_Daten!E39=\"w\"),\"N1w\",IF(AND(ASV_Daten!A39=\"1b\",ASV_Daten!E39=\"w\"),\"N1w\",IF(AND(ASV_Daten!A39=\"1b\",ASV_Daten!E39=\"m\"),\"N1m\",IF(AND(ASV_Daten!A39=\"2a\",ASV_Daten!E39=\"m\"),\"N2m\",IF(AND(ASV_Daten!A39=\"2a\",ASV_Daten!E39=\"w\"),\"N2w\",IF(AND(ASV_Daten!A39=\"2b\",ASV_Daten!E39=\"w\"),\"N2w\",IF(AND(ASV_Daten!A39=\"2b\",ASV_Daten!E39=\"m\"),\"N2m\",IF(AND(ASV_Daten!A39=\"3a\",ASV_Daten!E39=\"m\"),\"N3m\",IF(AND(ASV_Daten!A39=\"3a\",ASV_Daten!E39=\"w\"),\"N3w\",IF(AND(ASV_Daten!A39=\"3b\",ASV_Daten!E39=\"w\"),\"N3w\",IF(AND(ASV_Daten!A39=\"3b\",ASV_Daten!E39=\"m\"),\"N3m\",IF(AND(ASV_Daten!A39=\"4a\",ASV_Daten!E39=\"m\"),\"N4m\",IF(AND(ASV_Daten!A39=\"4a\",ASV_Daten!E39=\"w\"),\"N4w\",IF(AND(ASV_Daten!A39=\"4b\",ASV_Daten!E39=\"m\"),\"N4m\",IF(AND(ASV_Daten!A39=\"4b\",ASV_Daten!E39=\"w\"),\"N4w\"))))))))))))))))","v":false},"nix"]
[{"$f":"IF(ASV_Daten!A39=\"\",\"\",ASV_Daten!A39)","v":"5b"},{"$f":"IF(ASV_Daten!B39=\"\",\"\",ASV_Daten!B39)","v":"Grimmig"},{"$f":"IF(ASV_Daten!C39=\"\",\"\",ASV_Daten!C39)","v":"Karola"},{"$f":"IF(ASV_Daten!D39=\"\",\"\",ASV_Daten!D39)","v":2010},{"$f":"IF(ASV_Daten!E39=\"\",\"\",ASV_Daten!E39)","v":"w"},"5bw",{"$f":"IF(ASV_Daten!D40=\"\",\"\",$B$1-ASV_Daten!$D40)","v":11},{"$f":"G40&ASV_Daten!E40","v":"11w"},500,10.06,2.46,14.5,{"$f":"IF(ASV_Daten!E40=\"w\",(((800/I40)-2.0232)/0.00647),(((1000/I40)-2.158)/0.006))","v":-65.409582689335394},{"$f":"IF(ASV_Daten!$E40=\"w\",(((50/(J40+0.24))-3.648)/0.0066),IF(ASV_Daten!$E40=\"M\",(((50/(J40+0.24))-3.79)/0.0069),0))","v":182.78317152103551},{"$f":"IF(ASV_Daten!$E40=\"w\",((SQRT(K40)-1.0935)/0.00208),IF(ASV_Daten!$E40=\"m\",((SQRT(K40)-1.15028)/0.00219),0))","v":228.33592025760211},{"$f":"IF(ASV_Daten!E40=\"w\",((SQRT(L40)-2.0232)/0.00874),IF(ASV_Daten!$E40=\"M\",((SQRT(L40)-2.8)/0.011),0))","v":204.19754610205428},615,"T",{"$f":"IF(AND(ASV_Daten!A40=\"1a\",ASV_Daten!E40=\"m\"),\"N1m\",IF(AND(ASV_Daten!A40=\"1a\",ASV_Daten!E40=\"w\"),\"N1w\",IF(AND(ASV_Daten!A40=\"1b\",ASV_Daten!E40=\"w\"),\"N1w\",IF(AND(ASV_Daten!A40=\"1b\",ASV_Daten!E40=\"m\"),\"N1m\",IF(AND(ASV_Daten!A40=\"2a\",ASV_Daten!E40=\"m\"),\"N2m\",IF(AND(ASV_Daten!A40=\"2a\",ASV_Daten!E40=\"w\"),\"N2w\",IF(AND(ASV_Daten!A40=\"2b\",ASV_Daten!E40=\"w\"),\"N2w\",IF(AND(ASV_Daten!A40=\"2b\",ASV_Daten!E40=\"m\"),\"N2m\",IF(AND(ASV_Daten!A40=\"3a\",ASV_Daten!E40=\"m\"),\"N3m\",IF(AND(ASV_Daten!A40=\"3a\",ASV_Daten!E40=\"w\"),\"N3w\",IF(AND(ASV_Daten!A40=\"3b\",ASV_Daten!E40=\"w\"),\"N3w\",IF(AND(ASV_Daten!A40=\"3b\",ASV_Daten!E40=\"m\"),\"N3m\",IF(AND(ASV_Daten!A40=\"4a\",ASV_Daten!E40=\"m\"),\"N4m\",IF(AND(ASV_Daten!A40=\"4a\",ASV_Daten!E40=\"w\"),\"N4w\",IF(AND(ASV_Daten!A40=\"4b\",ASV_Daten!E40=\"m\"),\"N4m\",IF(AND(ASV_Daten!A40=\"4b\",ASV_Daten!E40=\"w\"),\"N4w\"))))))))))))))))","v":false},"nix"]
[{"$f":"IF(ASV_Daten!A40=\"\",\"\",ASV_Daten!A40)","v":"5b"},{"$f":"IF(ASV_Daten!B40=\"\",\"\",ASV_Daten!B40)","v":"Jordu"},{"$f":"IF(ASV_Daten!C40=\"\",\"\",ASV_Daten!C40)","v":"Jaja"},{"$f":"IF(ASV_Daten!D40=\"\",\"\",ASV_Daten!D40)","v":2010},{"$f":"IF(ASV_Daten!E40=\"\",\"\",ASV_Daten!E40)","v":"w"},"5bw",{"$f":"IF(ASV_Daten!D41=\"\",\"\",$B$1-ASV_Daten!$D41)","v":10},{"$f":"G41&ASV_Daten!E41","v":"10w"},500,10.87,2.2999999999999998,9,{"$f":"IF(ASV_Daten!E41=\"w\",(((800/I41)-2.0232)/0.00647),(((1000/I41)-2.158)/0.006))","v":-65.409582689335394},{"$f":"IF(ASV_Daten!$E41=\"w\",(((50/(J41+0.24))-3.648)/0.0066),IF(ASV_Daten!$E41=\"M\",(((50/(J41+0.24))-3.79)/0.0069),0))","v":129.15909772795459},{"$f":"IF(ASV_Daten!$E41=\"w\",((SQRT(K41)-1.0935)/0.00208),IF(ASV_Daten!$E41=\"m\",((SQRT(K41)-1.15028)/0.00219),0))","v":203.40148500495678},{"$f":"IF(ASV_Daten!E41=\"w\",((SQRT(L41)-2.0232)/0.00874),IF(ASV_Daten!$E41=\"M\",((SQRT(L41)-2.8)/0.011),0))","v":111.76201372997711},444,"T",{"$f":"IF(AND(ASV_Daten!A41=\"1a\",ASV_Daten!E41=\"m\"),\"N1m\",IF(AND(ASV_Daten!A41=\"1a\",ASV_Daten!E41=\"w\"),\"N1w\",IF(AND(ASV_Daten!A41=\"1b\",ASV_Daten!E41=\"w\"),\"N1w\",IF(AND(ASV_Daten!A41=\"1b\",ASV_Daten!E41=\"m\"),\"N1m\",IF(AND(ASV_Daten!A41=\"2a\",ASV_Daten!E41=\"m\"),\"N2m\",IF(AND(ASV_Daten!A41=\"2a\",ASV_Daten!E41=\"w\"),\"N2w\",IF(AND(ASV_Daten!A41=\"2b\",ASV_Daten!E41=\"w\"),\"N2w\",IF(AND(ASV_Daten!A41=\"2b\",ASV_Daten!E41=\"m\"),\"N2m\",IF(AND(ASV_Daten!A41=\"3a\",ASV_Daten!E41=\"m\"),\"N3m\",IF(AND(ASV_Daten!A41=\"3a\",ASV_Daten!E41=\"w\"),\"N3w\",IF(AND(ASV_Daten!A41=\"3b\",ASV_Daten!E41=\"w\"),\"N3w\",IF(AND(ASV_Daten!A41=\"3b\",ASV_Daten!E41=\"m\"),\"N3m\",IF(AND(ASV_Daten!A41=\"4a\",ASV_Daten!E41=\"m\"),\"N4m\",IF(AND(ASV_Daten!A41=\"4a\",ASV_Daten!E41=\"w\"),\"N4w\",IF(AND(ASV_Daten!A41=\"4b\",ASV_Daten!E41=\"m\"),\"N4m\",IF(AND(ASV_Daten!A41=\"4b\",ASV_Daten!E41=\"w\"),\"N4w\"))))))))))))))))","v":false},"nix"]
[{"$f":"IF(ASV_Daten!A41=\"\",\"\",ASV_Daten!A41)","v":"5b"},{"$f":"IF(ASV_Daten!B41=\"\",\"\",ASV_Daten!B41)","v":"Erdmann"},{"$f":"IF(ASV_Daten!C41=\"\",\"\",ASV_Daten!C41)","v":"Denise"},{"$f":"IF(ASV_Daten!D41=\"\",\"\",ASV_Daten!D41)","v":2011},{"$f":"IF(ASV_Daten!E41=\"\",\"\",ASV_Daten!E41)","v":"w"},"5bw",{"$f":"IF(ASV_Daten!D42=\"\",\"\",$B$1-ASV_Daten!$D42)","v":11},{"$f":"G42&ASV_Daten!E42","v":"11w"},500,10.69,2.5,7,{"$f":"IF(ASV_Daten!E42=\"w\",(((800/I42)-2.0232)/0.00647),(((1000/I42)-2.158)/0.006))","v":-65.409582689335394},{"$f":"IF(ASV_Daten!$E42=\"w\",(((50/(J42+0.24))-3.648)/0.0066),IF(ASV_Daten!$E42=\"M\",(((50/(J42+0.24))-3.79)/0.0069),0))","v":140.38869943718981},{"$f":"IF(ASV_Daten!$E42=\"w\",((SQRT(K42)-1.0935)/0.00208),IF(ASV_Daten!$E42=\"m\",((SQRT(K42)-1.15028)/0.00219),0))","v":234.4417452327836},{"$f":"IF(ASV_Daten!E42=\"w\",((SQRT(L42)-2.0232)/0.00874),IF(ASV_Daten!$E42=\"M\",((SQRT(L42)-2.8)/0.011),0))","v":71.230127124095034},446,"T",{"$f":"IF(AND(ASV_Daten!A42=\"1a\",ASV_Daten!E42=\"m\"),\"N1m\",IF(AND(ASV_Daten!A42=\"1a\",ASV_Daten!E42=\"w\"),\"N1w\",IF(AND(ASV_Daten!A42=\"1b\",ASV_Daten!E42=\"w\"),\"N1w\",IF(AND(ASV_Daten!A42=\"1b\",ASV_Daten!E42=\"m\"),\"N1m\",IF(AND(ASV_Daten!A42=\"2a\",ASV_Daten!E42=\"m\"),\"N2m\",IF(AND(ASV_Daten!A42=\"2a\",ASV_Daten!E42=\"w\"),\"N2w\",IF(AND(ASV_Daten!A42=\"2b\",ASV_Daten!E42=\"w\"),\"N2w\",IF(AND(ASV_Daten!A42=\"2b\",ASV_Daten!E42=\"m\"),\"N2m\",IF(AND(ASV_Daten!A42=\"3a\",ASV_Daten!E42=\"m\"),\"N3m\",IF(AND(ASV_Daten!A42=\"3a\",ASV_Daten!E42=\"w\"),\"N3w\",IF(AND(ASV_Daten!A42=\"3b\",ASV_Daten!E42=\"w\"),\"N3w\",IF(AND(ASV_Daten!A42=\"3b\",ASV_Daten!E42=\"m\"),\"N3m\",IF(AND(ASV_Daten!A42=\"4a\",ASV_Daten!E42=\"m\"),\"N4m\",IF(AND(ASV_Daten!A42=\"4a\",ASV_Daten!E42=\"w\"),\"N4w\",IF(AND(ASV_Daten!A42=\"4b\",ASV_Daten!E42=\"m\"),\"N4m\",IF(AND(ASV_Daten!A42=\"4b\",ASV_Daten!E42=\"w\"),\"N4w\"))))))))))))))))","v":false},"nix"]
[{"$f":"IF(ASV_Daten!A42=\"\",\"\",ASV_Daten!A42)","v":"5b"},{"$f":"IF(ASV_Daten!B42=\"\",\"\",ASV_Daten!B42)","v":"Greilinger"},{"$f":"IF(ASV_Daten!C42=\"\",\"\",ASV_Daten!C42)","v":"Fabienne"},{"$f":"IF(ASV_Daten!D42=\"\",\"\",ASV_Daten!D42)","v":2010},{"$f":"IF(ASV_Daten!E42=\"\",\"\",ASV_Daten!E42)","v":"w"},"5bw",{"$f":"IF(ASV_Daten!D43=\"\",\"\",$B$1-ASV_Daten!$D43)","v":11},{"$f":"G43&ASV_Daten!E43","v":"11m"},500,10.220000000000001,2.5,6,{"$f":"IF(ASV_Daten!E43=\"w\",(((800/I43)-2.0232)/0.00647),(((1000/I43)-2.158)/0.006))","v":-26.333333333333318},{"$f":"IF(ASV_Daten!$E43=\"w\",(((50/(J43+0.24))-3.648)/0.0066),IF(ASV_Daten!$E43=\"M\",(((50/(J43+0.24))-3.79)/0.0069),0))","v":143.4948873555573},{"$f":"IF(ASV_Daten!$E43=\"w\",((SQRT(K43)-1.0935)/0.00208),IF(ASV_Daten!$E43=\"m\",((SQRT(K43)-1.15028)/0.00219),0))","v":196.73919181926473},{"$f":"IF(ASV_Daten!E43=\"w\",((SQRT(L43)-2.0232)/0.00874),IF(ASV_Daten!$E43=\"M\",((SQRT(L43)-2.8)/0.011),0))","v":-31.864568837892907},314,"T",{"$f":"IF(AND(ASV_Daten!A43=\"1a\",ASV_Daten!E43=\"m\"),\"N1m\",IF(AND(ASV_Daten!A43=\"1a\",ASV_Daten!E43=\"w\"),\"N1w\",IF(AND(ASV_Daten!A43=\"1b\",ASV_Daten!E43=\"w\"),\"N1w\",IF(AND(ASV_Daten!A43=\"1b\",ASV_Daten!E43=\"m\"),\"N1m\",IF(AND(ASV_Daten!A43=\"2a\",ASV_Daten!E43=\"m\"),\"N2m\",IF(AND(ASV_Daten!A43=\"2a\",ASV_Daten!E43=\"w\"),\"N2w\",IF(AND(ASV_Daten!A43=\"2b\",ASV_Daten!E43=\"w\"),\"N2w\",IF(AND(ASV_Daten!A43=\"2b\",ASV_Daten!E43=\"m\"),\"N2m\",IF(AND(ASV_Daten!A43=\"3a\",ASV_Daten!E43=\"m\"),\"N3m\",IF(AND(ASV_Daten!A43=\"3a\",ASV_Daten!E43=\"w\"),\"N3w\",IF(AND(ASV_Daten!A43=\"3b\",ASV_Daten!E43=\"w\"),\"N3w\",IF(AND(ASV_Daten!A43=\"3b\",ASV_Daten!E43=\"m\"),\"N3m\",IF(AND(ASV_Daten!A43=\"4a\",ASV_Daten!E43=\"m\"),\"N4m\",IF(AND(ASV_Daten!A43=\"4a\",ASV_Daten!E43=\"w\"),\"N4w\",IF(AND(ASV_Daten!A43=\"4b\",ASV_Daten!E43=\"m\"),\"N4m\",IF(AND(ASV_Daten!A43=\"4b\",ASV_Daten!E43=\"w\"),\"N4w\"))))))))))))))))","v":false},"nix"]
[{"$f":"IF(ASV_Daten!A43=\"\",\"\",ASV_Daten!A43)","v":"5b"},{"$f":"IF(ASV_Daten!B43=\"\",\"\",ASV_Daten!B43)","v":"Hund"},{"$f":"IF(ASV_Daten!C43=\"\",\"\",ASV_Daten!C43)","v":"Kurt"},{"$f":"IF(ASV_Daten!D43=\"\",\"\",ASV_Daten!D43)","v":2010},{"$f":"IF(ASV_Daten!E43=\"\",\"\",ASV_Daten!E43)","v":"m"},"5bm",{"$f":"IF(ASV_Daten!D46=\"\",\"\",$B$1-ASV_Daten!$D46)","v":11},{"$f":"G44&ASV_Daten!E46","v":"11w"},500,9.7799999999999994,2.2000000000000002,8.5,{"$f":"IF(ASV_Daten!E46=\"w\",(((800/I44)-2.0232)/0.00647),(((1000/I44)-2.158)/0.006))","v":-65.409582689335394},{"$f":"IF(ASV_Daten!$E46=\"w\",(((50/(J44+0.24))-3.648)/0.0066),IF(ASV_Daten!$E46=\"M\",(((50/(J44+0.24))-3.79)/0.0069),0))","v":203.33635758785465},{"$f":"IF(ASV_Daten!$E46=\"w\",((SQRT(K44)-1.0935)/0.00208),IF(ASV_Daten!$E46=\"m\",((SQRT(K44)-1.15028)/0.00219),0))","v":187.37485452842921},{"$f":"IF(ASV_Daten!E46=\"w\",((SQRT(L44)-2.0232)/0.00874),IF(ASV_Daten!$E46=\"M\",((SQRT(L44)-2.8)/0.011),0))","v":102.09106949915908},493,"T",{"$f":"IF(AND(ASV_Daten!A46=\"1a\",ASV_Daten!E46=\"m\"),\"N1m\",IF(AND(ASV_Daten!A46=\"1a\",ASV_Daten!E46=\"w\"),\"N1w\",IF(AND(ASV_Daten!A46=\"1b\",ASV_Daten!E46=\"w\"),\"N1w\",IF(AND(ASV_Daten!A46=\"1b\",ASV_Daten!E46=\"m\"),\"N1m\",IF(AND(ASV_Daten!A46=\"2a\",ASV_Daten!E46=\"m\"),\"N2m\",IF(AND(ASV_Daten!A46=\"2a\",ASV_Daten!E46=\"w\"),\"N2w\",IF(AND(ASV_Daten!A46=\"2b\",ASV_Daten!E46=\"w\"),\"N2w\",IF(AND(ASV_Daten!A46=\"2b\",ASV_Daten!E46=\"m\"),\"N2m\",IF(AND(ASV_Daten!A46=\"3a\",ASV_Daten!E46=\"m\"),\"N3m\",IF(AND(ASV_Daten!A46=\"3a\",ASV_Daten!E46=\"w\"),\"N3w\",IF(AND(ASV_Daten!A46=\"3b\",ASV_Daten!E46=\"w\"),\"N3w\",IF(AND(ASV_Daten!A46=\"3b\",ASV_Daten!E46=\"m\"),\"N3m\",IF(AND(ASV_Daten!A46=\"4a\",ASV_Daten!E46=\"m\"),\"N4m\",IF(AND(ASV_Daten!A46=\"4a\",ASV_Daten!E46=\"w\"),\"N4w\",IF(AND(ASV_Daten!A46=\"4b\",ASV_Daten!E46=\"m\"),\"N4m\",IF(AND(ASV_Daten!A46=\"4b\",ASV_Daten!E46=\"w\"),\"N4w\"))))))))))))))))","v":false},"nix"]
[{"$f":"IF(ASV_Daten!A44=\"\",\"\",ASV_Daten!A44)","v":"5b"},{"$f":"IF(ASV_Daten!B44=\"\",\"\",ASV_Daten!B44)","v":"Penara"},{"$f":"IF(ASV_Daten!C44=\"\",\"\",ASV_Daten!C44)","v":"Horst"},{"$f":"IF(ASV_Daten!D44=\"\",\"\",ASV_Daten!D44)","v":2010},{"$f":"IF(ASV_Daten!E44=\"\",\"\",ASV_Daten!E44)","v":"m"},"5bm",{"$f":"IF(ASV_Daten!D47=\"\",\"\",$B$1-ASV_Daten!$D47)","v":11},{"$f":"G45&ASV_Daten!E47","v":"11w"},500,9.65,2.5,16.5,{"$f":"IF(ASV_Daten!E47=\"w\",(((800/I45)-2.0232)/0.00647),(((1000/I45)-2.158)/0.006))","v":-65.409582689335394},{"$f":"IF(ASV_Daten!$E47=\"w\",(((50/(J45+0.24))-3.648)/0.0066),IF(ASV_Daten!$E47=\"M\",(((50/(J45+0.24))-3.79)/0.0069),0))","v":213.27450439685015},{"$f":"IF(ASV_Daten!$E47=\"w\",((SQRT(K45)-1.0935)/0.00208),IF(ASV_Daten!$E47=\"m\",((SQRT(K45)-1.15028)/0.00219),0))","v":234.4417452327836},{"$f":"IF(ASV_Daten!E47=\"w\",((SQRT(L45)-2.0232)/0.00874),IF(ASV_Daten!$E47=\"M\",((SQRT(L45)-2.8)/0.011),0))","v":233.27450827436846},681,"T",{"$f":"IF(AND(ASV_Daten!A47=\"1a\",ASV_Daten!E47=\"m\"),\"N1m\",IF(AND(ASV_Daten!A47=\"1a\",ASV_Daten!E47=\"w\"),\"N1w\",IF(AND(ASV_Daten!A47=\"1b\",ASV_Daten!E47=\"w\"),\"N1w\",IF(AND(ASV_Daten!A47=\"1b\",ASV_Daten!E47=\"m\"),\"N1m\",IF(AND(ASV_Daten!A47=\"2a\",ASV_Daten!E47=\"m\"),\"N2m\",IF(AND(ASV_Daten!A47=\"2a\",ASV_Daten!E47=\"w\"),\"N2w\",IF(AND(ASV_Daten!A47=\"2b\",ASV_Daten!E47=\"w\"),\"N2w\",IF(AND(ASV_Daten!A47=\"2b\",ASV_Daten!E47=\"m\"),\"N2m\",IF(AND(ASV_Daten!A47=\"3a\",ASV_Daten!E47=\"m\"),\"N3m\",IF(AND(ASV_Daten!A47=\"3a\",ASV_Daten!E47=\"w\"),\"N3w\",IF(AND(ASV_Daten!A47=\"3b\",ASV_Daten!E47=\"w\"),\"N3w\",IF(AND(ASV_Daten!A47=\"3b\",ASV_Daten!E47=\"m\"),\"N3m\",IF(AND(ASV_Daten!A47=\"4a\",ASV_Daten!E47=\"m\"),\"N4m\",IF(AND(ASV_Daten!A47=\"4a\",ASV_Daten!E47=\"w\"),\"N4w\",IF(AND(ASV_Daten!A47=\"4b\",ASV_Daten!E47=\"m\"),\"N4m\",IF(AND(ASV_Daten!A47=\"4b\",ASV_Daten!E47=\"w\"),\"N4w\"))))))))))))))))","v":false},"nix"]
[{"$f":"IF(ASV_Daten!A45=\"\",\"\",ASV_Daten!A45)","v":"5b"},{"$f":"IF(ASV_Daten!B45=\"\",\"\",ASV_Daten!B45)","v":"Rieser"},{"$f":"IF(ASV_Daten!C45=\"\",\"\",ASV_Daten!C45)","v":"Jennifer"},{"$f":"IF(ASV_Daten!D45=\"\",\"\",ASV_Daten!D45)","v":2010},{"$f":"IF(ASV_Daten!E45=\"\",\"\",ASV_Daten!E45)","v":"w"},"5bw",{"$f":"IF(ASV_Daten!D48=\"\",\"\",$B$1-ASV_Daten!$D48)","v":11},{"$f":"G46&ASV_Daten!E48","v":"11w"},500,9.64,2.65,15.5,{"$f":"IF(ASV_Daten!E48=\"w\",(((800/I46)-2.0232)/0.00647),(((1000/I46)-2.158)/0.006))","v":-65.409582689335394},{"$f":"IF(ASV_Daten!$E48=\"w\",(((50/(J46+0.24))-3.648)/0.0066),IF(ASV_Daten!$E48=\"M\",(((50/(J46+0.24))-3.79)/0.0069),0))","v":214.04980983928351},{"$f":"IF(ASV_Daten!$E48=\"w\",((SQRT(K46)-1.0935)/0.00208),IF(ASV_Daten!$E48=\"m\",((SQRT(K46)-1.15028)/0.00219),0))","v":256.91445173556281},{"$f":"IF(ASV_Daten!E48=\"w\",((SQRT(L46)-2.0232)/0.00874),IF(ASV_Daten!$E48=\"M\",((SQRT(L46)-2.8)/0.011),0))","v":218.97070217458872},690,"T",{"$f":"IF(AND(ASV_Daten!A48=\"1a\",ASV_Daten!E48=\"m\"),\"N1m\",IF(AND(ASV_Daten!A48=\"1a\",ASV_Daten!E48=\"w\"),\"N1w\",IF(AND(ASV_Daten!A48=\"1b\",ASV_Daten!E48=\"w\"),\"N1w\",IF(AND(ASV_Daten!A48=\"1b\",ASV_Daten!E48=\"m\"),\"N1m\",IF(AND(ASV_Daten!A48=\"2a\",ASV_Daten!E48=\"m\"),\"N2m\",IF(AND(ASV_Daten!A48=\"2a\",ASV_Daten!E48=\"w\"),\"N2w\",IF(AND(ASV_Daten!A48=\"2b\",ASV_Daten!E48=\"w\"),\"N2w\",IF(AND(ASV_Daten!A48=\"2b\",ASV_Daten!E48=\"m\"),\"N2m\",IF(AND(ASV_Daten!A48=\"3a\",ASV_Daten!E48=\"m\"),\"N3m\",IF(AND(ASV_Daten!A48=\"3a\",ASV_Daten!E48=\"w\"),\"N3w\",IF(AND(ASV_Daten!A48=\"3b\",ASV_Daten!E48=\"w\"),\"N3w\",IF(AND(ASV_Daten!A48=\"3b\",ASV_Daten!E48=\"m\"),\"N3m\",IF(AND(ASV_Daten!A48=\"4a\",ASV_Daten!E48=\"m\"),\"N4m\",IF(AND(ASV_Daten!A48=\"4a\",ASV_Daten!E48=\"w\"),\"N4w\",IF(AND(ASV_Daten!A48=\"4b\",ASV_Daten!E48=\"m\"),\"N4m\",IF(AND(ASV_Daten!A48=\"4b\",ASV_Daten!E48=\"w\"),\"N4w\"))))))))))))))))","v":false},"nix"]
[{"$f":"IF(ASV_Daten!A46=\"\",\"\",ASV_Daten!A46)","v":"5b"},{"$f":"IF(ASV_Daten!B46=\"\",\"\",ASV_Daten!B46)","v":"Schoning"},{"$f":"IF(ASV_Daten!C46=\"\",\"\",ASV_Daten!C46)","v":"Daniela"},{"$f":"IF(ASV_Daten!D46=\"\",\"\",ASV_Daten!D46)","v":2010},{"$f":"IF(ASV_Daten!E46=\"\",\"\",ASV_Daten!E46)","v":"w"},"5bw",{"$f":"IF(ASV_Daten!D51=\"\",\"\",$B$1-ASV_Daten!$D51)","v":11},{"$f":"G47&ASV_Daten!E51","v":"11m"},500,9.9700000000000006,2.56,8,{"$f":"IF(ASV_Daten!E51=\"w\",(((800/I47)-2.0232)/0.00647),(((1000/I47)-2.158)/0.006))","v":-26.333333333333318},{"$f":"IF(ASV_Daten!$E51=\"w\",(((50/(J47+0.24))-3.648)/0.0066),IF(ASV_Daten!$E51=\"M\",(((50/(J47+0.24))-3.79)/0.0069),0))","v":160.45791991369643},{"$f":"IF(ASV_Daten!$E51=\"w\",((SQRT(K47)-1.0935)/0.00208),IF(ASV_Daten!$E51=\"m\",((SQRT(K47)-1.15028)/0.00219),0))","v":205.35159817351604},{"$f":"IF(ASV_Daten!E51=\"w\",((SQRT(L47)-2.0232)/0.00874),IF(ASV_Daten!$E51=\"M\",((SQRT(L47)-2.8)/0.011),0))","v":2.5842840678354975},368,"T",{"$f":"IF(AND(ASV_Daten!A51=\"1a\",ASV_Daten!E51=\"m\"),\"N1m\",IF(AND(ASV_Daten!A51=\"1a\",ASV_Daten!E51=\"w\"),\"N1w\",IF(AND(ASV_Daten!A51=\"1b\",ASV_Daten!E51=\"w\"),\"N1w\",IF(AND(ASV_Daten!A51=\"1b\",ASV_Daten!E51=\"m\"),\"N1m\",IF(AND(ASV_Daten!A51=\"2a\",ASV_Daten!E51=\"m\"),\"N2m\",IF(AND(ASV_Daten!A51=\"2a\",ASV_Daten!E51=\"w\"),\"N2w\",IF(AND(ASV_Daten!A51=\"2b\",ASV_Daten!E51=\"w\"),\"N2w\",IF(AND(ASV_Daten!A51=\"2b\",ASV_Daten!E51=\"m\"),\"N2m\",IF(AND(ASV_Daten!A51=\"3a\",ASV_Daten!E51=\"m\"),\"N3m\",IF(AND(ASV_Daten!A51=\"3a\",ASV_Daten!E51=\"w\"),\"N3w\",IF(AND(ASV_Daten!A51=\"3b\",ASV_Daten!E51=\"w\"),\"N3w\",IF(AND(ASV_Daten!A51=\"3b\",ASV_Daten!E51=\"m\"),\"N3m\",IF(AND(ASV_Daten!A51=\"4a\",ASV_Daten!E51=\"m\"),\"N4m\",IF(AND(ASV_Daten!A51=\"4a\",ASV_Daten!E51=\"w\"),\"N4w\",IF(AND(ASV_Daten!A51=\"4b\",ASV_Daten!E51=\"m\"),\"N4m\",IF(AND(ASV_Daten!A51=\"4b\",ASV_Daten!E51=\"w\"),\"N4w\"))))))))))))))))","v":false},"nix"]
[{"$f":"IF(ASV_Daten!A47=\"\",\"\",ASV_Daten!A47)","v":"5b"},{"$f":"IF(ASV_Daten!B47=\"\",\"\",ASV_Daten!B47)","v":"Grimmig"},{"$f":"IF(ASV_Daten!C47=\"\",\"\",ASV_Daten!C47)","v":"Karola"},{"$f":"IF(ASV_Daten!D47=\"\",\"\",ASV_Daten!D47)","v":2010},{"$f":"IF(ASV_Daten!E47=\"\",\"\",ASV_Daten!E47)","v":"w"},"5bw",{"$f":"IF(ASV_Daten!D53=\"\",\"\",$B$1-ASV_Daten!$D53)","v":11},{"$f":"G48&ASV_Daten!E53","v":"11w"},500,10.28,2.33,12,{"$f":"IF(ASV_Daten!E53=\"w\",(((800/I48)-2.0232)/0.00647),(((1000/I48)-2.158)/0.006))","v":-65.409582689335394},{"$f":"IF(ASV_Daten!$E53=\"w\",(((50/(J48+0.24))-3.648)/0.0066),IF(ASV_Daten!$E53=\"M\",(((50/(J48+0.24))-3.79)/0.0069),0))","v":167.4017743979721},{"$f":"IF(ASV_Daten!$E53=\"w\",((SQRT(K48)-1.0935)/0.00208),IF(ASV_Daten!$E53=\"m\",((SQRT(K48)-1.15028)/0.00219),0))","v":208.14122704200716},{"$f":"IF(ASV_Daten!E53=\"w\",((SQRT(L48)-2.0232)/0.00874),IF(ASV_Daten!$E53=\"M\",((SQRT(L48)-2.8)/0.011),0))","v":164.86288502720302},540,"T",{"$f":"IF(AND(ASV_Daten!A53=\"1a\",ASV_Daten!E53=\"m\"),\"N1m\",IF(AND(ASV_Daten!A53=\"1a\",ASV_Daten!E53=\"w\"),\"N1w\",IF(AND(ASV_Daten!A53=\"1b\",ASV_Daten!E53=\"w\"),\"N1w\",IF(AND(ASV_Daten!A53=\"1b\",ASV_Daten!E53=\"m\"),\"N1m\",IF(AND(ASV_Daten!A53=\"2a\",ASV_Daten!E53=\"m\"),\"N2m\",IF(AND(ASV_Daten!A53=\"2a\",ASV_Daten!E53=\"w\"),\"N2w\",IF(AND(ASV_Daten!A53=\"2b\",ASV_Daten!E53=\"w\"),\"N2w\",IF(AND(ASV_Daten!A53=\"2b\",ASV_Daten!E53=\"m\"),\"N2m\",IF(AND(ASV_Daten!A53=\"3a\",ASV_Daten!E53=\"m\"),\"N3m\",IF(AND(ASV_Daten!A53=\"3a\",ASV_Daten!E53=\"w\"),\"N3w\",IF(AND(ASV_Daten!A53=\"3b\",ASV_Daten!E53=\"w\"),\"N3w\",IF(AND(ASV_Daten!A53=\"3b\",ASV_Daten!E53=\"m\"),\"N3m\",IF(AND(ASV_Daten!A53=\"4a\",ASV_Daten!E53=\"m\"),\"N4m\",IF(AND(ASV_Daten!A53=\"4a\",ASV_Daten!E53=\"w\"),\"N4w\",IF(AND(ASV_Daten!A53=\"4b\",ASV_Daten!E53=\"m\"),\"N4m\",IF(AND(ASV_Daten!A53=\"4b\",ASV_Daten!E53=\"w\"),\"N4w\"))))))))))))))))","v":false},"nix"]
[{"$f":"IF(ASV_Daten!A48=\"\",\"\",ASV_Daten!A48)","v":"5b"},{"$f":"IF(ASV_Daten!B48=\"\",\"\",ASV_Daten!B48)","v":"Jordu"},{"$f":"IF(ASV_Daten!C48=\"\",\"\",ASV_Daten!C48)","v":"Jaja"},{"$f":"IF(ASV_Daten!D48=\"\",\"\",ASV_Daten!D48)","v":2010},{"$f":"IF(ASV_Daten!E48=\"\",\"\",ASV_Daten!E48)","v":"w"},"5bw",{"$f":"IF(ASV_Daten!D37=\"\",\"\",$B$1-ASV_Daten!$D37)","v":11},{"$f":"G49&ASV_Daten!E37","v":"11w"},500,10.91,2.2000000000000002,16.5,{"$f":"IF(ASV_Daten!E37=\"w\",(((800/I49)-2.0232)/0.00647),(((1000/I49)-2.158)/0.006))","v":-65.409582689335394},{"$f":"IF(ASV_Daten!$E37=\"w\",(((50/(J49+0.24))-3.648)/0.0066),IF(ASV_Daten!$E37=\"M\",(((50/(J49+0.24))-3.79)/0.0069),0))","v":126.71286859627659},{"$f":"IF(ASV_Daten!$E37=\"w\",((SQRT(K49)-1.0935)/0.00208),IF(ASV_Daten!$E37=\"m\",((SQRT(K49)-1.15028)/0.00219),0))","v":187.37485452842921},{"$f":"IF(ASV_Daten!E37=\"w\",((SQRT(L49)-2.0232)/0.00874),IF(ASV_Daten!$E37=\"M\",((SQRT(L49)-2.8)/0.011),0))","v":233.27450827436846},547,"T",{"$f":"IF(AND(ASV_Daten!A37=\"1a\",ASV_Daten!E37=\"m\"),\"N1m\",IF(AND(ASV_Daten!A37=\"1a\",ASV_Daten!E37=\"w\"),\"N1w\",IF(AND(ASV_Daten!A37=\"1b\",ASV_Daten!E37=\"w\"),\"N1w\",IF(AND(ASV_Daten!A37=\"1b\",ASV_Daten!E37=\"m\"),\"N1m\",IF(AND(ASV_Daten!A37=\"2a\",ASV_Daten!E37=\"m\"),\"N2m\",IF(AND(ASV_Daten!A37=\"2a\",ASV_Daten!E37=\"w\"),\"N2w\",IF(AND(ASV_Daten!A37=\"2b\",ASV_Daten!E37=\"w\"),\"N2w\",IF(AND(ASV_Daten!A37=\"2b\",ASV_Daten!E37=\"m\"),\"N2m\",IF(AND(ASV_Daten!A37=\"3a\",ASV_Daten!E37=\"m\"),\"N3m\",IF(AND(ASV_Daten!A37=\"3a\",ASV_Daten!E37=\"w\"),\"N3w\",IF(AND(ASV_Daten!A37=\"3b\",ASV_Daten!E37=\"w\"),\"N3w\",IF(AND(ASV_Daten!A37=\"3b\",ASV_Daten!E37=\"m\"),\"N3m\",IF(AND(ASV_Daten!A37=\"4a\",ASV_Daten!E37=\"m\"),\"N4m\",IF(AND(ASV_Daten!A37=\"4a\",ASV_Daten!E37=\"w\"),\"N4w\",IF(AND(ASV_Daten!A37=\"4b\",ASV_Daten!E37=\"m\"),\"N4m\",IF(AND(ASV_Daten!A37=\"4b\",ASV_Daten!E37=\"w\"),\"N4w\"))))))))))))))))","v":false},"nix"]
[{"$f":"IF(ASV_Daten!A49=\"\",\"\",ASV_Daten!A49)","v":"5b"},{"$f":"IF(ASV_Daten!B49=\"\",\"\",ASV_Daten!B49)","v":"Erdmann"},{"$f":"IF(ASV_Daten!C49=\"\",\"\",ASV_Daten!C49)","v":"Denise"},{"$f":"IF(ASV_Daten!D49=\"\",\"\",ASV_Daten!D49)","v":2011},{"$f":"IF(ASV_Daten!E49=\"\",\"\",ASV_Daten!E49)","v":"w"},"5bw",{"$f":"IF(ASV_Daten!D44=\"\",\"\",$B$1-ASV_Daten!$D44)","v":11},{"$f":"G50&ASV_Daten!E44","v":"11m"},500,10.84,2.4,9.5,{"$f":"IF(ASV_Daten!E44=\"w\",(((800/I50)-2.0232)/0.00647),(((1000/I50)-2.158)/0.006))","v":-26.333333333333318},{"$f":"IF(ASV_Daten!$E44=\"w\",(((50/(J50+0.24))-3.648)/0.0066),IF(ASV_Daten!$E44=\"M\",(((50/(J50+0.24))-3.79)/0.0069),0))","v":104.72976508135827},{"$f":"IF(ASV_Daten!$E44=\"w\",((SQRT(K50)-1.0935)/0.00208),IF(ASV_Daten!$E44=\"m\",((SQRT(K50)-1.15028)/0.00219),0))","v":182.15220935295289},{"$f":"IF(ASV_Daten!E44=\"w\",((SQRT(L50)-2.0232)/0.00874),IF(ASV_Daten!$E44=\"M\",((SQRT(L50)-2.8)/0.011),0))","v":25.65518195313529},313,"T",{"$f":"IF(AND(ASV_Daten!A44=\"1a\",ASV_Daten!E44=\"m\"),\"N1m\",IF(AND(ASV_Daten!A44=\"1a\",ASV_Daten!E44=\"w\"),\"N1w\",IF(AND(ASV_Daten!A44=\"1b\",ASV_Daten!E44=\"w\"),\"N1w\",IF(AND(ASV_Daten!A44=\"1b\",ASV_Daten!E44=\"m\"),\"N1m\",IF(AND(ASV_Daten!A44=\"2a\",ASV_Daten!E44=\"m\"),\"N2m\",IF(AND(ASV_Daten!A44=\"2a\",ASV_Daten!E44=\"w\"),\"N2w\",IF(AND(ASV_Daten!A44=\"2b\",ASV_Daten!E44=\"w\"),\"N2w\",IF(AND(ASV_Daten!A44=\"2b\",ASV_Daten!E44=\"m\"),\"N2m\",IF(AND(ASV_Daten!A44=\"3a\",ASV_Daten!E44=\"m\"),\"N3m\",IF(AND(ASV_Daten!A44=\"3a\",ASV_Daten!E44=\"w\"),\"N3w\",IF(AND(ASV_Daten!A44=\"3b\",ASV_Daten!E44=\"w\"),\"N3w\",IF(AND(ASV_Daten!A44=\"3b\",ASV_Daten!E44=\"m\"),\"N3m\",IF(AND(ASV_Daten!A44=\"4a\",ASV_Daten!E44=\"m\"),\"N4m\",IF(AND(ASV_Daten!A44=\"4a\",ASV_Daten!E44=\"w\"),\"N4w\",IF(AND(ASV_Daten!A44=\"4b\",ASV_Daten!E44=\"m\"),\"N4m\",IF(AND(ASV_Daten!A44=\"4b\",ASV_Daten!E44=\"w\"),\"N4w\"))))))))))))))))","v":false},"nix"]
[{"$f":"IF(ASV_Daten!A50=\"\",\"\",ASV_Daten!A50)","v":"5b"},{"$f":"IF(ASV_Daten!B50=\"\",\"\",ASV_Daten!B50)","v":"Greilinger"},{"$f":"IF(ASV_Daten!C50=\"\",\"\",ASV_Daten!C50)","v":"Fabienne"},{"$f":"IF(ASV_Daten!D50=\"\",\"\",ASV_Daten!D50)","v":2010},{"$f":"IF(ASV_Daten!E50=\"\",\"\",ASV_Daten!E50)","v":"w"},"5bw",{"$f":"IF(ASV_Daten!D45=\"\",\"\",$B$1-ASV_Daten!$D45)","v":11},{"$f":"G51&ASV_Daten!E45","v":"11w"},500,10.72,2.54,9,{"$f":"IF(ASV_Daten!E45=\"w\",(((800/I51)-2.0232)/0.00647),(((1000/I51)-2.158)/0.006))","v":-65.409582689335394},{"$f":"IF(ASV_Daten!$E45=\"w\",(((50/(J51+0.24))-3.648)/0.0066),IF(ASV_Daten!$E45=\"M\",(((50/(J51+0.24))-3.79)/0.0069),0))","v":138.4914841849147},{"$f":"IF(ASV_Daten!$E45=\"w\",((SQRT(K51)-1.0935)/0.00208),IF(ASV_Daten!$E45=\"m\",((SQRT(K51)-1.15028)/0.00219),0))","v":240.49891588986674},{"$f":"IF(ASV_Daten!E45=\"w\",((SQRT(L51)-2.0232)/0.00874),IF(ASV_Daten!$E45=\"M\",((SQRT(L51)-2.8)/0.011),0))","v":111.76201372997711},491,"T",{"$f":"IF(AND(ASV_Daten!A45=\"1a\",ASV_Daten!E45=\"m\"),\"N1m\",IF(AND(ASV_Daten!A45=\"1a\",ASV_Daten!E45=\"w\"),\"N1w\",IF(AND(ASV_Daten!A45=\"1b\",ASV_Daten!E45=\"w\"),\"N1w\",IF(AND(ASV_Daten!A45=\"1b\",ASV_Daten!E45=\"m\"),\"N1m\",IF(AND(ASV_Daten!A45=\"2a\",ASV_Daten!E45=\"m\"),\"N2m\",IF(AND(ASV_Daten!A45=\"2a\",ASV_Daten!E45=\"w\"),\"N2w\",IF(AND(ASV_Daten!A45=\"2b\",ASV_Daten!E45=\"w\"),\"N2w\",IF(AND(ASV_Daten!A45=\"2b\",ASV_Daten!E45=\"m\"),\"N2m\",IF(AND(ASV_Daten!A45=\"3a\",ASV_Daten!E45=\"m\"),\"N3m\",IF(AND(ASV_Daten!A45=\"3a\",ASV_Daten!E45=\"w\"),\"N3w\",IF(AND(ASV_Daten!A45=\"3b\",ASV_Daten!E45=\"w\"),\"N3w\",IF(AND(ASV_Daten!A45=\"3b\",ASV_Daten!E45=\"m\"),\"N3m\",IF(AND(ASV_Daten!A45=\"4a\",ASV_Daten!E45=\"m\"),\"N4m\",IF(AND(ASV_Daten!A45=\"4a\",ASV_Daten!E45=\"w\"),\"N4w\",IF(AND(ASV_Daten!A45=\"4b\",ASV_Daten!E45=\"m\"),\"N4m\",IF(AND(ASV_Daten!A45=\"4b\",ASV_Daten!E45=\"w\"),\"N4w\"))))))))))))))))","v":false},"nix"]
[{"$f":"IF(ASV_Daten!A51=\"\",\"\",ASV_Daten!A51)","v":"5b"},{"$f":"IF(ASV_Daten!B51=\"\",\"\",ASV_Daten!B51)","v":"Hund"},{"$f":"IF(ASV_Daten!C51=\"\",\"\",ASV_Daten!C51)","v":"Kurt"},{"$f":"IF(ASV_Daten!D51=\"\",\"\",ASV_Daten!D51)","v":2010},{"$f":"IF(ASV_Daten!E51=\"\",\"\",ASV_Daten!E51)","v":"m"},"5bm",{"$f":"IF(ASV_Daten!D49=\"\",\"\",$B$1-ASV_Daten!$D49)","v":10},{"$f":"G52&ASV_Daten!E49","v":"10w"},500,10.06,2.72,18,{"$f":"IF(ASV_Daten!E49=\"w\",(((800/I52)-2.0232)/0.00647),(((1000/I52)-2.158)/0.006))","v":-65.409582689335394},{"$f":"IF(ASV_Daten!$E49=\"w\",(((50/(J52+0.24))-3.648)/0.0066),IF(ASV_Daten!$E49=\"M\",(((50/(J52+0.24))-3.79)/0.0069),0))","v":182.78317152103551},{"$f":"IF(ASV_Daten!$E49=\"w\",((SQRT(K52)-1.0935)/0.00208),IF(ASV_Daten!$E49=\"m\",((SQRT(K52)-1.15028)/0.00219),0))","v":267.18377415724251},{"$f":"IF(ASV_Daten!E49=\"w\",((SQRT(L52)-2.0232)/0.00874),IF(ASV_Daten!$E49=\"M\",((SQRT(L52)-2.8)/0.011),0))","v":253.94058205026141},704,"S",{"$f":"IF(AND(ASV_Daten!A49=\"1a\",ASV_Daten!E49=\"m\"),\"N1m\",IF(AND(ASV_Daten!A49=\"1a\",ASV_Daten!E49=\"w\"),\"N1w\",IF(AND(ASV_Daten!A49=\"1b\",ASV_Daten!E49=\"w\"),\"N1w\",IF(AND(ASV_Daten!A49=\"1b\",ASV_Daten!E49=\"m\"),\"N1m\",IF(AND(ASV_Daten!A49=\"2a\",ASV_Daten!E49=\"m\"),\"N2m\",IF(AND(ASV_Daten!A49=\"2a\",ASV_Daten!E49=\"w\"),\"N2w\",IF(AND(ASV_Daten!A49=\"2b\",ASV_Daten!E49=\"w\"),\"N2w\",IF(AND(ASV_Daten!A49=\"2b\",ASV_Daten!E49=\"m\"),\"N2m\",IF(AND(ASV_Daten!A49=\"3a\",ASV_Daten!E49=\"m\"),\"N3m\",IF(AND(ASV_Daten!A49=\"3a\",ASV_Daten!E49=\"w\"),\"N3w\",IF(AND(ASV_Daten!A49=\"3b\",ASV_Daten!E49=\"w\"),\"N3w\",IF(AND(ASV_Daten!A49=\"3b\",ASV_Daten!E49=\"m\"),\"N3m\",IF(AND(ASV_Daten!A49=\"4a\",ASV_Daten!E49=\"m\"),\"N4m\",IF(AND(ASV_Daten!A49=\"4a\",ASV_Daten!E49=\"w\"),\"N4w\",IF(AND(ASV_Daten!A49=\"4b\",ASV_Daten!E49=\"m\"),\"N4m\",IF(AND(ASV_Daten!A49=\"4b\",ASV_Daten!E49=\"w\"),\"N4w\"))))))))))))))))","v":false},"nix"]
[{"$f":"IF(ASV_Daten!A52=\"\",\"\",ASV_Daten!A52)","v":"5b"},{"$f":"IF(ASV_Daten!B52=\"\",\"\",ASV_Daten!B52)","v":"Penara"},{"$f":"IF(ASV_Daten!C52=\"\",\"\",ASV_Daten!C52)","v":"Horst"},{"$f":"IF(ASV_Daten!D52=\"\",\"\",ASV_Daten!D52)","v":2010},{"$f":"IF(ASV_Daten!E52=\"\",\"\",ASV_Daten!E52)","v":"m"},"5bm",{"$f":"IF(ASV_Daten!D50=\"\",\"\",$B$1-ASV_Daten!$D50)","v":11},{"$f":"G53&ASV_Daten!E50","v":"11w"},500,9.9700000000000006,2.62,7.5,{"$f":"IF(ASV_Daten!E50=\"w\",(((800/I53)-2.0232)/0.00647),(((1000/I53)-2.158)/0.006))","v":-65.409582689335394},{"$f":"IF(ASV_Daten!$E50=\"w\",(((50/(J53+0.24))-3.648)/0.0066),IF(ASV_Daten!$E50=\"M\",(((50/(J53+0.24))-3.79)/0.0069),0))","v":189.26661324310686},{"$f":"IF(ASV_Daten!$E50=\"w\",((SQRT(K53)-1.0935)/0.00208),IF(ASV_Daten!$E50=\"m\",((SQRT(K53)-1.15028)/0.00219),0))","v":252.47182962685798},{"$f":"IF(ASV_Daten!E50=\"w\",((SQRT(L53)-2.0232)/0.00874),IF(ASV_Daten!$E50=\"M\",((SQRT(L53)-2.8)/0.011),0))","v":81.855010014397081},524,"T",{"$f":"IF(AND(ASV_Daten!A50=\"1a\",ASV_Daten!E50=\"m\"),\"N1m\",IF(AND(ASV_Daten!A50=\"1a\",ASV_Daten!E50=\"w\"),\"N1w\",IF(AND(ASV_Daten!A50=\"1b\",ASV_Daten!E50=\"w\"),\"N1w\",IF(AND(ASV_Daten!A50=\"1b\",ASV_Daten!E50=\"m\"),\"N1m\",IF(AND(ASV_Daten!A50=\"2a\",ASV_Daten!E50=\"m\"),\"N2m\",IF(AND(ASV_Daten!A50=\"2a\",ASV_Daten!E50=\"w\"),\"N2w\",IF(AND(ASV_Daten!A50=\"2b\",ASV_Daten!E50=\"w\"),\"N2w\",IF(AND(ASV_Daten!A50=\"2b\",ASV_Daten!E50=\"m\"),\"N2m\",IF(AND(ASV_Daten!A50=\"3a\",ASV_Daten!E50=\"m\"),\"N3m\",IF(AND(ASV_Daten!A50=\"3a\",ASV_Daten!E50=\"w\"),\"N3w\",IF(AND(ASV_Daten!A50=\"3b\",ASV_Daten!E50=\"w\"),\"N3w\",IF(AND(ASV_Daten!A50=\"3b\",ASV_Daten!E50=\"m\"),\"N3m\",IF(AND(ASV_Daten!A50=\"4a\",ASV_Daten!E50=\"m\"),\"N4m\",IF(AND(ASV_Daten!A50=\"4a\",ASV_Daten!E50=\"w\"),\"N4w\",IF(AND(ASV_Daten!A50=\"4b\",ASV_Daten!E50=\"m\"),\"N4m\",IF(AND(ASV_Daten!A50=\"4b\",ASV_Daten!E50=\"w\"),\"N4w\"))))))))))))))))","v":false},"nix"]
[{"$f":"IF(ASV_Daten!A53=\"\",\"\",ASV_Daten!A53)","v":"5b"},{"$f":"IF(ASV_Daten!B53=\"\",\"\",ASV_Daten!B53)","v":"Rieser"},{"$f":"IF(ASV_Daten!C53=\"\",\"\",ASV_Daten!C53)","v":"Jennifer"},{"$f":"IF(ASV_Daten!D53=\"\",\"\",ASV_Daten!D53)","v":2010},{"$f":"IF(ASV_Daten!E53=\"\",\"\",ASV_Daten!E53)","v":"w"},"5bw",{"$f":"IF(ASV_Daten!D52=\"\",\"\",$B$1-ASV_Daten!$D52)","v":11},{"$f":"G54&ASV_Daten!E52","v":"11m"},500,9.5,3.12,12,{"$f":"IF(ASV_Daten!E52=\"w\",(((800/I54)-2.0232)/0.00647),(((1000/I54)-2.158)/0.006))","v":-26.333333333333318},{"$f":"IF(ASV_Daten!$E52=\"w\",(((50/(J54+0.24))-3.648)/0.0066),IF(ASV_Daten!$E52=\"M\",(((50/(J54+0.24))-3.79)/0.0069),0))","v":194.70582983662166},{"$f":"IF(ASV_Daten!$E52=\"w\",((SQRT(K54)-1.0935)/0.00208),IF(ASV_Daten!$E52=\"m\",((SQRT(K54)-1.15028)/0.00219),0))","v":281.31149464181249},{"$f":"IF(ASV_Daten!E52=\"w\",((SQRT(L54)-2.0232)/0.00874),IF(ASV_Daten!$E52=\"M\",((SQRT(L54)-2.8)/0.011),0))","v":60.372874103432238},536,"T",{"$f":"IF(AND(ASV_Daten!A52=\"1a\",ASV_Daten!E52=\"m\"),\"N1m\",IF(AND(ASV_Daten!A52=\"1a\",ASV_Daten!E52=\"w\"),\"N1w\",IF(AND(ASV_Daten!A52=\"1b\",ASV_Daten!E52=\"w\"),\"N1w\",IF(AND(ASV_Daten!A52=\"1b\",ASV_Daten!E52=\"m\"),\"N1m\",IF(AND(ASV_Daten!A52=\"2a\",ASV_Daten!E52=\"m\"),\"N2m\",IF(AND(ASV_Daten!A52=\"2a\",ASV_Daten!E52=\"w\"),\"N2w\",IF(AND(ASV_Daten!A52=\"2b\",ASV_Daten!E52=\"w\"),\"N2w\",IF(AND(ASV_Daten!A52=\"2b\",ASV_Daten!E52=\"m\"),\"N2m\",IF(AND(ASV_Daten!A52=\"3a\",ASV_Daten!E52=\"m\"),\"N3m\",IF(AND(ASV_Daten!A52=\"3a\",ASV_Daten!E52=\"w\"),\"N3w\",IF(AND(ASV_Daten!A52=\"3b\",ASV_Daten!E52=\"w\"),\"N3w\",IF(AND(ASV_Daten!A52=\"3b\",ASV_Daten!E52=\"m\"),\"N3m\",IF(AND(ASV_Daten!A52=\"4a\",ASV_Daten!E52=\"m\"),\"N4m\",IF(AND(ASV_Daten!A52=\"4a\",ASV_Daten!E52=\"w\"),\"N4w\",IF(AND(ASV_Daten!A52=\"4b\",ASV_Daten!E52=\"m\"),\"N4m\",IF(AND(ASV_Daten!A52=\"4b\",ASV_Daten!E52=\"w\"),\"N4w\"))))))))))))))))","v":false},"nix"]
[{"$f":"IF(ASV_Daten!A54=\"\",\"\",ASV_Daten!A54)","v":"5b"},{"$f":"IF(ASV_Daten!B54=\"\",\"\",ASV_Daten!B54)","v":"Schoning"},{"$f":"IF(ASV_Daten!C54=\"\",\"\",ASV_Daten!C54)","v":"Daniela"},{"$f":"IF(ASV_Daten!D54=\"\",\"\",ASV_Daten!D54)","v":2010},{"$f":"IF(ASV_Daten!E54=\"\",\"\",ASV_Daten!E54)","v":"w"},"5bw",{"$f":"IF(ASV_Daten!D54=\"\",\"\",$B$1-ASV_Daten!$D54)","v":11},{"$f":"G55&ASV_Daten!E54","v":"11w"},500,10.87,2.2999999999999998,15,{"$f":"IF(ASV_Daten!E54=\"w\",(((800/I55)-2.0232)/0.00647),(((1000/I55)-2.158)/0.006))","v":-65.409582689335394},{"$f":"IF(ASV_Daten!$E54=\"w\",(((50/(J55+0.24))-3.648)/0.0066),IF(ASV_Daten!$E54=\"M\",(((50/(J55+0.24))-3.79)/0.0069),0))","v":129.15909772795459},{"$f":"IF(ASV_Daten!$E54=\"w\",((SQRT(K55)-1.0935)/0.00208),IF(ASV_Daten!$E54=\"m\",((SQRT(K55)-1.15028)/0.00219),0))","v":203.40148500495678},{"$f":"IF(ASV_Daten!E54=\"w\",((SQRT(L55)-2.0232)/0.00874),IF(ASV_Daten!$E54=\"M\",((SQRT(L55)-2.8)/0.011),0))","v":211.64569178574564},544,"T",{"$f":"IF(AND(ASV_Daten!A54=\"1a\",ASV_Daten!E54=\"m\"),\"N1m\",IF(AND(ASV_Daten!A54=\"1a\",ASV_Daten!E54=\"w\"),\"N1w\",IF(AND(ASV_Daten!A54=\"1b\",ASV_Daten!E54=\"w\"),\"N1w\",IF(AND(ASV_Daten!A54=\"1b\",ASV_Daten!E54=\"m\"),\"N1m\",IF(AND(ASV_Daten!A54=\"2a\",ASV_Daten!E54=\"m\"),\"N2m\",IF(AND(ASV_Daten!A54=\"2a\",ASV_Daten!E54=\"w\"),\"N2w\",IF(AND(ASV_Daten!A54=\"2b\",ASV_Daten!E54=\"w\"),\"N2w\",IF(AND(ASV_Daten!A54=\"2b\",ASV_Daten!E54=\"m\"),\"N2m\",IF(AND(ASV_Daten!A54=\"3a\",ASV_Daten!E54=\"m\"),\"N3m\",IF(AND(ASV_Daten!A54=\"3a\",ASV_Daten!E54=\"w\"),\"N3w\",IF(AND(ASV_Daten!A54=\"3b\",ASV_Daten!E54=\"w\"),\"N3w\",IF(AND(ASV_Daten!A54=\"3b\",ASV_Daten!E54=\"m\"),\"N3m\",IF(AND(ASV_Daten!A54=\"4a\",ASV_Daten!E54=\"m\"),\"N4m\",IF(AND(ASV_Daten!A54=\"4a\",ASV_Daten!E54=\"w\"),\"N4w\",IF(AND(ASV_Daten!A54=\"4b\",ASV_Daten!E54=\"m\"),\"N4m\",IF(AND(ASV_Daten!A54=\"4b\",ASV_Daten!E54=\"w\"),\"N4w\"))))))))))))))))","v":false},"nix"]
[{"$f":"IF(ASV_Daten!A55=\"\",\"\",ASV_Daten!A55)","v":"5b"},{"$f":"IF(ASV_Daten!B55=\"\",\"\",ASV_Daten!B55)","v":"Grimmig"},{"$f":"IF(ASV_Daten!C55=\"\",\"\",ASV_Daten!C55)","v":"Karola"},{"$f":"IF(ASV_Daten!D55=\"\",\"\",ASV_Daten!D55)","v":2010},{"$f":"IF(ASV_Daten!E55=\"\",\"\",ASV_Daten!E55)","v":"w"},"5bw",{"$f":"IF(ASV_Daten!D56=\"\",\"\",$B$1-ASV_Daten!$D56)","v":11},{"$f":"G56&ASV_Daten!E56","v":"11w"},500,9.7200000000000006,2.62,9,{"$f":"IF(ASV_Daten!E56=\"w\",(((800/I56)-2.0232)/0.00647),(((1000/I56)-2.158)/0.006))","v":-65.409582689335394},{"$f":"IF(ASV_Daten!$E56=\"w\",(((50/(J56+0.24))-3.648)/0.0066),IF(ASV_Daten!$E56=\"M\",(((50/(J56+0.24))-3.79)/0.0069),0))","v":207.89095777047572},{"$f":"IF(ASV_Daten!$E56=\"w\",((SQRT(K56)-1.0935)/0.00208),IF(ASV_Daten!$E56=\"m\",((SQRT(K56)-1.15028)/0.00219),0))","v":252.47182962685798},{"$f":"IF(ASV_Daten!E56=\"w\",((SQRT(L56)-2.0232)/0.00874),IF(ASV_Daten!$E56=\"M\",((SQRT(L56)-2.8)/0.011),0))","v":111.76201372997711},572,"T",{"$f":"IF(AND(ASV_Daten!A56=\"1a\",ASV_Daten!E56=\"m\"),\"N1m\",IF(AND(ASV_Daten!A56=\"1a\",ASV_Daten!E56=\"w\"),\"N1w\",IF(AND(ASV_Daten!A56=\"1b\",ASV_Daten!E56=\"w\"),\"N1w\",IF(AND(ASV_Daten!A56=\"1b\",ASV_Daten!E56=\"m\"),\"N1m\",IF(AND(ASV_Daten!A56=\"2a\",ASV_Daten!E56=\"m\"),\"N2m\",IF(AND(ASV_Daten!A56=\"2a\",ASV_Daten!E56=\"w\"),\"N2w\",IF(AND(ASV_Daten!A56=\"2b\",ASV_Daten!E56=\"w\"),\"N2w\",IF(AND(ASV_Daten!A56=\"2b\",ASV_Daten!E56=\"m\"),\"N2m\",IF(AND(ASV_Daten!A56=\"3a\",ASV_Daten!E56=\"m\"),\"N3m\",IF(AND(ASV_Daten!A56=\"3a\",ASV_Daten!E56=\"w\"),\"N3w\",IF(AND(ASV_Daten!A56=\"3b\",ASV_Daten!E56=\"w\"),\"N3w\",IF(AND(ASV_Daten!A56=\"3b\",ASV_Daten!E56=\"m\"),\"N3m\",IF(AND(ASV_Daten!A56=\"4a\",ASV_Daten!E56=\"m\"),\"N4m\",IF(AND(ASV_Daten!A56=\"4a\",ASV_Daten!E56=\"w\"),\"N4w\",IF(AND(ASV_Daten!A56=\"4b\",ASV_Daten!E56=\"m\"),\"N4m\",IF(AND(ASV_Daten!A56=\"4b\",ASV_Daten!E56=\"w\"),\"N4w\"))))))))))))))))","v":false},"nix"]
[{"$f":"IF(ASV_Daten!A56=\"\",\"\",ASV_Daten!A56)","v":"5b"},{"$f":"IF(ASV_Daten!B56=\"\",\"\",ASV_Daten!B56)","v":"Jordu"},{"$f":"IF(ASV_Daten!C56=\"\",\"\",ASV_Daten!C56)","v":"Jaja"},{"$f":"IF(ASV_Daten!D56=\"\",\"\",ASV_Daten!D56)","v":2010},{"$f":"IF(ASV_Daten!E56=\"\",\"\",ASV_Daten!E56)","v":"w"},"5bw",{"$f":"IF(ASV_Daten!D61=\"\",\"\",$B$1-ASV_Daten!$D61)","v":10},{"$f":"G57&ASV_Daten!E61","v":"10w"},500,9.43,2.86,20.5,{"$f":"IF(ASV_Daten!E61=\"w\",(((800/I57)-2.0232)/0.00647),(((1000/I57)-2.158)/0.006))","v":-65.409582689335394},{"$f":"IF(ASV_Daten!$E61=\"w\",(((50/(J57+0.24))-3.648)/0.0066),IF(ASV_Daten!$E61=\"M\",(((50/(J57+0.24))-3.79)/0.0069),0))","v":230.70163893328314},{"$f":"IF(ASV_Daten!$E61=\"w\",((SQRT(K57)-1.0935)/0.00208),IF(ASV_Daten!$E61=\"m\",((SQRT(K57)-1.15028)/0.00219),0))","v":287.33339063883483},{"$f":"IF(ASV_Daten!E61=\"w\",((SQRT(L57)-2.0232)/0.00874),IF(ASV_Daten!$E61=\"M\",((SQRT(L57)-2.8)/0.011),0))","v":286.55521385225501},805,"S",{"$f":"IF(AND(ASV_Daten!A61=\"1a\",ASV_Daten!E61=\"m\"),\"N1m\",IF(AND(ASV_Daten!A61=\"1a\",ASV_Daten!E61=\"w\"),\"N1w\",IF(AND(ASV_Daten!A61=\"1b\",ASV_Daten!E61=\"w\"),\"N1w\",IF(AND(ASV_Daten!A61=\"1b\",ASV_Daten!E61=\"m\"),\"N1m\",IF(AND(ASV_Daten!A61=\"2a\",ASV_Daten!E61=\"m\"),\"N2m\",IF(AND(ASV_Daten!A61=\"2a\",ASV_Daten!E61=\"w\"),\"N2w\",IF(AND(ASV_Daten!A61=\"2b\",ASV_Daten!E61=\"w\"),\"N2w\",IF(AND(ASV_Daten!A61=\"2b\",ASV_Daten!E61=\"m\"),\"N2m\",IF(AND(ASV_Daten!A61=\"3a\",ASV_Daten!E61=\"m\"),\"N3m\",IF(AND(ASV_Daten!A61=\"3a\",ASV_Daten!E61=\"w\"),\"N3w\",IF(AND(ASV_Daten!A61=\"3b\",ASV_Daten!E61=\"w\"),\"N3w\",IF(AND(ASV_Daten!A61=\"3b\",ASV_Daten!E61=\"m\"),\"N3m\",IF(AND(ASV_Daten!A61=\"4a\",ASV_Daten!E61=\"m\"),\"N4m\",IF(AND(ASV_Daten!A61=\"4a\",ASV_Daten!E61=\"w\"),\"N4w\",IF(AND(ASV_Daten!A61=\"4b\",ASV_Daten!E61=\"m\"),\"N4m\",IF(AND(ASV_Daten!A61=\"4b\",ASV_Daten!E61=\"w\"),\"N4w\"))))))))))))))))","v":false},"nix"]
[{"$f":"IF(ASV_Daten!A57=\"\",\"\",ASV_Daten!A57)","v":"5b"},{"$f":"IF(ASV_Daten!B57=\"\",\"\",ASV_Daten!B57)","v":"Erdmann"},{"$f":"IF(ASV_Daten!C57=\"\",\"\",ASV_Daten!C57)","v":"Denise"},{"$f":"IF(ASV_Daten!D57=\"\",\"\",ASV_Daten!D57)","v":2011},{"$f":"IF(ASV_Daten!E57=\"\",\"\",ASV_Daten!E57)","v":"w"},"5bw",{"$f":"IF(ASV_Daten!D64=\"\",\"\",$B$1-ASV_Daten!$D64)","v":10},{"$f":"G58&ASV_Daten!E64","v":"10w"},500,12.72,2.78,3,{"$f":"IF(ASV_Daten!E64=\"w\",(((800/I58)-2.0232)/0.00647),(((1000/I58)-2.158)/0.006))","v":-65.409582689335394},{"$f":"IF(ASV_Daten!$E64=\"w\",(((50/(J58+0.24))-3.648)/0.0066),IF(ASV_Daten!$E64=\"M\",(((50/(J58+0.24))-3.79)/0.0069),0))","v":31.821922933033996},{"$f":"IF(ASV_Daten!$E64=\"w\",((SQRT(K58)-1.0935)/0.00208),IF(ASV_Daten!$E64=\"m\",((SQRT(K58)-1.15028)/0.00219),0))","v":275.88134617947435},{"$f":"IF(ASV_Daten!E64=\"w\",((SQRT(L58)-2.0232)/0.00874),IF(ASV_Daten!$E64=\"M\",((SQRT(L58)-2.8)/0.011),0))","v":-33.312264580220017},274,"T",{"$f":"IF(AND(ASV_Daten!A64=\"1a\",ASV_Daten!E64=\"m\"),\"N1m\",IF(AND(ASV_Daten!A64=\"1a\",ASV_Daten!E64=\"w\"),\"N1w\",IF(AND(ASV_Daten!A64=\"1b\",ASV_Daten!E64=\"w\"),\"N1w\",IF(AND(ASV_Daten!A64=\"1b\",ASV_Daten!E64=\"m\"),\"N1m\",IF(AND(ASV_Daten!A64=\"2a\",ASV_Daten!E64=\"m\"),\"N2m\",IF(AND(ASV_Daten!A64=\"2a\",ASV_Daten!E64=\"w\"),\"N2w\",IF(AND(ASV_Daten!A64=\"2b\",ASV_Daten!E64=\"w\"),\"N2w\",IF(AND(ASV_Daten!A64=\"2b\",ASV_Daten!E64=\"m\"),\"N2m\",IF(AND(ASV_Daten!A64=\"3a\",ASV_Daten!E64=\"m\"),\"N3m\",IF(AND(ASV_Daten!A64=\"3a\",ASV_Daten!E64=\"w\"),\"N3w\",IF(AND(ASV_Daten!A64=\"3b\",ASV_Daten!E64=\"w\"),\"N3w\",IF(AND(ASV_Daten!A64=\"3b\",ASV_Daten!E64=\"m\"),\"N3m\",IF(AND(ASV_Daten!A64=\"4a\",ASV_Daten!E64=\"m\"),\"N4m\",IF(AND(ASV_Daten!A64=\"4a\",ASV_Daten!E64=\"w\"),\"N4w\",IF(AND(ASV_Daten!A64=\"4b\",ASV_Daten!E64=\"m\"),\"N4m\",IF(AND(ASV_Daten!A64=\"4b\",ASV_Daten!E64=\"w\"),\"N4w\"))))))))))))))))","v":false},"nix"]
[{"$f":"IF(ASV_Daten!A58=\"\",\"\",ASV_Daten!A58)","v":"5b"},{"$f":"IF(ASV_Daten!B58=\"\",\"\",ASV_Daten!B58)","v":"Greilinger"},{"$f":"IF(ASV_Daten!C58=\"\",\"\",ASV_Daten!C58)","v":"Fabienne"},{"$f":"IF(ASV_Daten!D58=\"\",\"\",ASV_Daten!D58)","v":2010},{"$f":"IF(ASV_Daten!E58=\"\",\"\",ASV_Daten!E58)","v":"w"},"5bw",{"$f":"IF(ASV_Daten!D65=\"\",\"\",$B$1-ASV_Daten!$D65)","v":10},{"$f":"G59&ASV_Daten!E65","v":"10w"},386,11.65,2.08,11,{"$f":"IF(ASV_Daten!E65=\"w\",(((800/I59)-2.0232)/0.00647),(((1000/I59)-2.158)/0.006))","v":7.6257898150891261},{"$f":"IF(ASV_Daten!$E65=\"w\",(((50/(J59+0.24))-3.648)/0.0066),IF(ASV_Daten!$E65=\"M\",(((50/(J59+0.24))-3.79)/0.0069),0))","v":84.426434232994353},{"$f":"IF(ASV_Daten!$E65=\"w\",((SQRT(K59)-1.0935)/0.00208),IF(ASV_Daten!$E65=\"m\",((SQRT(K59)-1.15028)/0.00219),0))","v":167.65409143538267},{"$f":"IF(ASV_Daten!E65=\"w\",((SQRT(L59)-2.0232)/0.00874),IF(ASV_Daten!$E65=\"M\",((SQRT(L59)-2.8)/0.011),0))","v":147.98910644798625},400,"T",{"$f":"IF(AND(ASV_Daten!A65=\"1a\",ASV_Daten!E65=\"m\"),\"N1m\",IF(AND(ASV_Daten!A65=\"1a\",ASV_Daten!E65=\"w\"),\"N1w\",IF(AND(ASV_Daten!A65=\"1b\",ASV_Daten!E65=\"w\"),\"N1w\",IF(AND(ASV_Daten!A65=\"1b\",ASV_Daten!E65=\"m\"),\"N1m\",IF(AND(ASV_Daten!A65=\"2a\",ASV_Daten!E65=\"m\"),\"N2m\",IF(AND(ASV_Daten!A65=\"2a\",ASV_Daten!E65=\"w\"),\"N2w\",IF(AND(ASV_Daten!A65=\"2b\",ASV_Daten!E65=\"w\"),\"N2w\",IF(AND(ASV_Daten!A65=\"2b\",ASV_Daten!E65=\"m\"),\"N2m\",IF(AND(ASV_Daten!A65=\"3a\",ASV_Daten!E65=\"m\"),\"N3m\",IF(AND(ASV_Daten!A65=\"3a\",ASV_Daten!E65=\"w\"),\"N3w\",IF(AND(ASV_Daten!A65=\"3b\",ASV_Daten!E65=\"w\"),\"N3w\",IF(AND(ASV_Daten!A65=\"3b\",ASV_Daten!E65=\"m\"),\"N3m\",IF(AND(ASV_Daten!A65=\"4a\",ASV_Daten!E65=\"m\"),\"N4m\",IF(AND(ASV_Daten!A65=\"4a\",ASV_Daten!E65=\"w\"),\"N4w\",IF(AND(ASV_Daten!A65=\"4b\",ASV_Daten!E65=\"m\"),\"N4m\",IF(AND(ASV_Daten!A65=\"4b\",ASV_Daten!E65=\"w\"),\"N4w\"))))))))))))))))","v":false},"nix"]
[{"$f":"IF(ASV_Daten!A59=\"\",\"\",ASV_Daten!A59)","v":"5c"},{"$f":"IF(ASV_Daten!B59=\"\",\"\",ASV_Daten!B59)","v":"Klassen"},{"$f":"IF(ASV_Daten!C59=\"\",\"\",ASV_Daten!C59)","v":"Leonie"},{"$f":"IF(ASV_Daten!D59=\"\",\"\",ASV_Daten!D59)","v":2010},{"$f":"IF(ASV_Daten!E59=\"\",\"\",ASV_Daten!E59)","v":"w"},"5cw",{"$f":"IF(ASV_Daten!D67=\"\",\"\",$B$1-ASV_Daten!$D67)","v":10},{"$f":"G60&ASV_Daten!E67","v":"10w"},500,10.56,2.65,8.5,{"$f":"IF(ASV_Daten!E67=\"w\",(((800/I60)-2.0232)/0.00647),(((1000/I60)-2.158)/0.006))","v":-65.409582689335394},{"$f":"IF(ASV_Daten!$E67=\"w\",(((50/(J60+0.24))-3.648)/0.0066),IF(ASV_Daten!$E67=\"M\",(((50/(J60+0.24))-3.79)/0.0069),0))","v":148.73176206509541},{"$f":"IF(ASV_Daten!$E67=\"w\",((SQRT(K60)-1.0935)/0.00208),IF(ASV_Daten!$E67=\"m\",((SQRT(K60)-1.15028)/0.00219),0))","v":256.91445173556281},{"$f":"IF(ASV_Daten!E67=\"w\",((SQRT(L60)-2.0232)/0.00874),IF(ASV_Daten!$E67=\"M\",((SQRT(L60)-2.8)/0.011),0))","v":102.09106949915908},508,"T",{"$f":"IF(AND(ASV_Daten!A67=\"1a\",ASV_Daten!E67=\"m\"),\"N1m\",IF(AND(ASV_Daten!A67=\"1a\",ASV_Daten!E67=\"w\"),\"N1w\",IF(AND(ASV_Daten!A67=\"1b\",ASV_Daten!E67=\"w\"),\"N1w\",IF(AND(ASV_Daten!A67=\"1b\",ASV_Daten!E67=\"m\"),\"N1m\",IF(AND(ASV_Daten!A67=\"2a\",ASV_Daten!E67=\"m\"),\"N2m\",IF(AND(ASV_Daten!A67=\"2a\",ASV_Daten!E67=\"w\"),\"N2w\",IF(AND(ASV_Daten!A67=\"2b\",ASV_Daten!E67=\"w\"),\"N2w\",IF(AND(ASV_Daten!A67=\"2b\",ASV_Daten!E67=\"m\"),\"N2m\",IF(AND(ASV_Daten!A67=\"3a\",ASV_Daten!E67=\"m\"),\"N3m\",IF(AND(ASV_Daten!A67=\"3a\",ASV_Daten!E67=\"w\"),\"N3w\",IF(AND(ASV_Daten!A67=\"3b\",ASV_Daten!E67=\"w\"),\"N3w\",IF(AND(ASV_Daten!A67=\"3b\",ASV_Daten!E67=\"m\"),\"N3m\",IF(AND(ASV_Daten!A67=\"4a\",ASV_Daten!E67=\"m\"),\"N4m\",IF(AND(ASV_Daten!A67=\"4a\",ASV_Daten!E67=\"w\"),\"N4w\",IF(AND(ASV_Daten!A67=\"4b\",ASV_Daten!E67=\"m\"),\"N4m\",IF(AND(ASV_Daten!A67=\"4b\",ASV_Daten!E67=\"w\"),\"N4w\"))))))))))))))))","v":false},"nix"]
[{"$f":"IF(ASV_Daten!A60=\"\",\"\",ASV_Daten!A60)","v":"5c"},{"$f":"IF(ASV_Daten!B60=\"\",\"\",ASV_Daten!B60)","v":"Moll"},{"$f":"IF(ASV_Daten!C60=\"\",\"\",ASV_Daten!C60)","v":"Quirinia"},{"$f":"IF(ASV_Daten!D60=\"\",\"\",ASV_Daten!D60)","v":2011},{"$f":"IF(ASV_Daten!E60=\"\",\"\",ASV_Daten!E60)","v":"w"},"5cw",{"$f":"IF(ASV_Daten!D68=\"\",\"\",$B$1-ASV_Daten!$D68)","v":10},{"$f":"G61&ASV_Daten!E68","v":"10w"},500,11.13,2.54,6.5,{"$f":"IF(ASV_Daten!E68=\"w\",(((800/I61)-2.0232)/0.00647),(((1000/I61)-2.158)/0.006))","v":-65.409582689335394},{"$f":"IF(ASV_Daten!$E68=\"w\",(((50/(J61+0.24))-3.648)/0.0066),IF(ASV_Daten!$E68=\"M\",(((50/(J61+0.24))-3.79)/0.0069),0))","v":113.56626955571542},{"$f":"IF(ASV_Daten!$E68=\"w\",((SQRT(K61)-1.0935)/0.00208),IF(ASV_Daten!$E68=\"m\",((SQRT(K61)-1.15028)/0.00219),0))","v":240.49891588986674},{"$f":"IF(ASV_Daten!E68=\"w\",((SQRT(L61)-2.0232)/0.00874),IF(ASV_Daten!$E68=\"M\",((SQRT(L61)-2.8)/0.011),0))","v":60.218507642607797},414,"T",{"$f":"IF(AND(ASV_Daten!A68=\"1a\",ASV_Daten!E68=\"m\"),\"N1m\",IF(AND(ASV_Daten!A68=\"1a\",ASV_Daten!E68=\"w\"),\"N1w\",IF(AND(ASV_Daten!A68=\"1b\",ASV_Daten!E68=\"w\"),\"N1w\",IF(AND(ASV_Daten!A68=\"1b\",ASV_Daten!E68=\"m\"),\"N1m\",IF(AND(ASV_Daten!A68=\"2a\",ASV_Daten!E68=\"m\"),\"N2m\",IF(AND(ASV_Daten!A68=\"2a\",ASV_Daten!E68=\"w\"),\"N2w\",IF(AND(ASV_Daten!A68=\"2b\",ASV_Daten!E68=\"w\"),\"N2w\",IF(AND(ASV_Daten!A68=\"2b\",ASV_Daten!E68=\"m\"),\"N2m\",IF(AND(ASV_Daten!A68=\"3a\",ASV_Daten!E68=\"m\"),\"N3m\",IF(AND(ASV_Daten!A68=\"3a\",ASV_Daten!E68=\"w\"),\"N3w\",IF(AND(ASV_Daten!A68=\"3b\",ASV_Daten!E68=\"w\"),\"N3w\",IF(AND(ASV_Daten!A68=\"3b\",ASV_Daten!E68=\"m\"),\"N3m\",IF(AND(ASV_Daten!A68=\"4a\",ASV_Daten!E68=\"m\"),\"N4m\",IF(AND(ASV_Daten!A68=\"4a\",ASV_Daten!E68=\"w\"),\"N4w\",IF(AND(ASV_Daten!A68=\"4b\",ASV_Daten!E68=\"m\"),\"N4m\",IF(AND(ASV_Daten!A68=\"4b\",ASV_Daten!E68=\"w\"),\"N4w\"))))))))))))))))","v":false},"nix"]
[{"$f":"IF(ASV_Daten!A61=\"\",\"\",ASV_Daten!A61)","v":"5c"},{"$f":"IF(ASV_Daten!B61=\"\",\"\",ASV_Daten!B61)","v":"Salger"},{"$f":"IF(ASV_Daten!C61=\"\",\"\",ASV_Daten!C61)","v":"Stephanie"},{"$f":"IF(ASV_Daten!D61=\"\",\"\",ASV_Daten!D61)","v":2011},{"$f":"IF(ASV_Daten!E61=\"\",\"\",ASV_Daten!E61)","v":"w"},"5cw",{"$f":"IF(ASV_Daten!D69=\"\",\"\",$B$1-ASV_Daten!$D69)","v":10},{"$f":"G62&ASV_Daten!E69","v":"10w"},500,10.19,1.82,9.5,{"$f":"IF(ASV_Daten!E69=\"w\",(((800/I62)-2.0232)/0.00647),(((1000/I62)-2.158)/0.006))","v":-65.409582689335394},{"$f":"IF(ASV_Daten!$E69=\"w\",(((50/(J62+0.24))-3.648)/0.0066),IF(ASV_Daten!$E69=\"M\",(((50/(J62+0.24))-3.79)/0.0069),0))","v":173.61573549493016},{"$f":"IF(ASV_Daten!$E69=\"w\",((SQRT(K62)-1.0935)/0.00208),IF(ASV_Daten!$E69=\"m\",((SQRT(K62)-1.15028)/0.00219),0))","v":122.87199823230979},{"$f":"IF(ASV_Daten!E69=\"w\",((SQRT(L62)-2.0232)/0.00874),IF(ASV_Daten!$E69=\"M\",((SQRT(L62)-2.8)/0.011),0))","v":121.16784914010159},418,"T",{"$f":"IF(AND(ASV_Daten!A69=\"1a\",ASV_Daten!E69=\"m\"),\"N1m\",IF(AND(ASV_Daten!A69=\"1a\",ASV_Daten!E69=\"w\"),\"N1w\",IF(AND(ASV_Daten!A69=\"1b\",ASV_Daten!E69=\"w\"),\"N1w\",IF(AND(ASV_Daten!A69=\"1b\",ASV_Daten!E69=\"m\"),\"N1m\",IF(AND(ASV_Daten!A69=\"2a\",ASV_Daten!E69=\"m\"),\"N2m\",IF(AND(ASV_Daten!A69=\"2a\",ASV_Daten!E69=\"w\"),\"N2w\",IF(AND(ASV_Daten!A69=\"2b\",ASV_Daten!E69=\"w\"),\"N2w\",IF(AND(ASV_Daten!A69=\"2b\",ASV_Daten!E69=\"m\"),\"N2m\",IF(AND(ASV_Daten!A69=\"3a\",ASV_Daten!E69=\"m\"),\"N3m\",IF(AND(ASV_Daten!A69=\"3a\",ASV_Daten!E69=\"w\"),\"N3w\",IF(AND(ASV_Daten!A69=\"3b\",ASV_Daten!E69=\"w\"),\"N3w\",IF(AND(ASV_Daten!A69=\"3b\",ASV_Daten!E69=\"m\"),\"N3m\",IF(AND(ASV_Daten!A69=\"4a\",ASV_Daten!E69=\"m\"),\"N4m\",IF(AND(ASV_Daten!A69=\"4a\",ASV_Daten!E69=\"w\"),\"N4w\",IF(AND(ASV_Daten!A69=\"4b\",ASV_Daten!E69=\"m\"),\"N4m\",IF(AND(ASV_Daten!A69=\"4b\",ASV_Daten!E69=\"w\"),\"N4w\"))))))))))))))))","v":false},"nix"]
[{"$f":"IF(ASV_Daten!A62=\"\",\"\",ASV_Daten!A62)","v":"5c"},{"$f":"IF(ASV_Daten!B62=\"\",\"\",ASV_Daten!B62)","v":"Steinhart"},{"$f":"IF(ASV_Daten!C62=\"\",\"\",ASV_Daten!C62)","v":"Philippa"},{"$f":"IF(ASV_Daten!D62=\"\",\"\",ASV_Daten!D62)","v":2011},{"$f":"IF(ASV_Daten!E62=\"\",\"\",ASV_Daten!E62)","v":"w"},"5cw",{"$f":"IF(ASV_Daten!D70=\"\",\"\",$B$1-ASV_Daten!$D70)","v":10},{"$f":"G63&ASV_Daten!E70","v":"10w"},364,10.19,2.54,15.5,{"$f":"IF(ASV_Daten!E70=\"w\",(((800/I63)-2.0232)/0.00647),(((1000/I63)-2.158)/0.006))","v":26.986429335733831},{"$f":"IF(ASV_Daten!$E70=\"w\",(((50/(J63+0.24))-3.648)/0.0066),IF(ASV_Daten!$E70=\"M\",(((50/(J63+0.24))-3.79)/0.0069),0))","v":173.61573549493016},{"$f":"IF(ASV_Daten!$E70=\"w\",((SQRT(K63)-1.0935)/0.00208),IF(ASV_Daten!$E70=\"m\",((SQRT(K63)-1.15028)/0.00219),0))","v":240.49891588986674},{"$f":"IF(ASV_Daten!E70=\"w\",((SQRT(L63)-2.0232)/0.00874),IF(ASV_Daten!$E70=\"M\",((SQRT(L63)-2.8)/0.011),0))","v":218.97070217458872},633,"S",{"$f":"IF(AND(ASV_Daten!A70=\"1a\",ASV_Daten!E70=\"m\"),\"N1m\",IF(AND(ASV_Daten!A70=\"1a\",ASV_Daten!E70=\"w\"),\"N1w\",IF(AND(ASV_Daten!A70=\"1b\",ASV_Daten!E70=\"w\"),\"N1w\",IF(AND(ASV_Daten!A70=\"1b\",ASV_Daten!E70=\"m\"),\"N1m\",IF(AND(ASV_Daten!A70=\"2a\",ASV_Daten!E70=\"m\"),\"N2m\",IF(AND(ASV_Daten!A70=\"2a\",ASV_Daten!E70=\"w\"),\"N2w\",IF(AND(ASV_Daten!A70=\"2b\",ASV_Daten!E70=\"w\"),\"N2w\",IF(AND(ASV_Daten!A70=\"2b\",ASV_Daten!E70=\"m\"),\"N2m\",IF(AND(ASV_Daten!A70=\"3a\",ASV_Daten!E70=\"m\"),\"N3m\",IF(AND(ASV_Daten!A70=\"3a\",ASV_Daten!E70=\"w\"),\"N3w\",IF(AND(ASV_Daten!A70=\"3b\",ASV_Daten!E70=\"w\"),\"N3w\",IF(AND(ASV_Daten!A70=\"3b\",ASV_Daten!E70=\"m\"),\"N3m\",IF(AND(ASV_Daten!A70=\"4a\",ASV_Daten!E70=\"m\"),\"N4m\",IF(AND(ASV_Daten!A70=\"4a\",ASV_Daten!E70=\"w\"),\"N4w\",IF(AND(ASV_Daten!A70=\"4b\",ASV_Daten!E70=\"m\"),\"N4m\",IF(AND(ASV_Daten!A70=\"4b\",ASV_Daten!E70=\"w\"),\"N4w\"))))))))))))))))","v":false},"nix"]
[{"$f":"IF(ASV_Daten!A63=\"\",\"\",ASV_Daten!A63)","v":"5c"},{"$f":"IF(ASV_Daten!B63=\"\",\"\",ASV_Daten!B63)","v":"wein"},{"$f":"IF(ASV_Daten!C63=\"\",\"\",ASV_Daten!C63)","v":"Daniela"},{"$f":"IF(ASV_Daten!D63=\"\",\"\",ASV_Daten!D63)","v":2011},{"$f":"IF(ASV_Daten!E63=\"\",\"\",ASV_Daten!E63)","v":"w"},"5cw",{"$f":"IF(ASV_Daten!D71=\"\",\"\",$B$1-ASV_Daten!$D71)","v":10},{"$f":"G64&ASV_Daten!E71","v":"10w"},500,9.9700000000000006,2.75,13,{"$f":"IF(ASV_Daten!E71=\"w\",(((800/I64)-2.0232)/0.00647),(((1000/I64)-2.158)/0.006))","v":-65.409582689335394},{"$f":"IF(ASV_Daten!$E71=\"w\",(((50/(J64+0.24))-3.648)/0.0066),IF(ASV_Daten!$E71=\"M\",(((50/(J64+0.24))-3.79)/0.0069),0))","v":189.26661324310686},{"$f":"IF(ASV_Daten!$E71=\"w\",((SQRT(K64)-1.0935)/0.00208),IF(ASV_Daten!$E71=\"m\",((SQRT(K64)-1.15028)/0.00219),0))","v":271.54442075850966},{"$f":"IF(ASV_Daten!E71=\"w\",((SQRT(L64)-2.0232)/0.00874),IF(ASV_Daten!$E71=\"M\",((SQRT(L64)-2.8)/0.011),0))","v":181.04705668924362},642,"S",{"$f":"IF(AND(ASV_Daten!A71=\"1a\",ASV_Daten!E71=\"m\"),\"N1m\",IF(AND(ASV_Daten!A71=\"1a\",ASV_Daten!E71=\"w\"),\"N1w\",IF(AND(ASV_Daten!A71=\"1b\",ASV_Daten!E71=\"w\"),\"N1w\",IF(AND(ASV_Daten!A71=\"1b\",ASV_Daten!E71=\"m\"),\"N1m\",IF(AND(ASV_Daten!A71=\"2a\",ASV_Daten!E71=\"m\"),\"N2m\",IF(AND(ASV_Daten!A71=\"2a\",ASV_Daten!E71=\"w\"),\"N2w\",IF(AND(ASV_Daten!A71=\"2b\",ASV_Daten!E71=\"w\"),\"N2w\",IF(AND(ASV_Daten!A71=\"2b\",ASV_Daten!E71=\"m\"),\"N2m\",IF(AND(ASV_Daten!A71=\"3a\",ASV_Daten!E71=\"m\"),\"N3m\",IF(AND(ASV_Daten!A71=\"3a\",ASV_Daten!E71=\"w\"),\"N3w\",IF(AND(ASV_Daten!A71=\"3b\",ASV_Daten!E71=\"w\"),\"N3w\",IF(AND(ASV_Daten!A71=\"3b\",ASV_Daten!E71=\"m\"),\"N3m\",IF(AND(ASV_Daten!A71=\"4a\",ASV_Daten!E71=\"m\"),\"N4m\",IF(AND(ASV_Daten!A71=\"4a\",ASV_Daten!E71=\"w\"),\"N4w\",IF(AND(ASV_Daten!A71=\"4b\",ASV_Daten!E71=\"m\"),\"N4m\",IF(AND(ASV_Daten!A71=\"4b\",ASV_Daten!E71=\"w\"),\"N4w\"))))))))))))))))","v":false},"nix"]
[{"$f":"IF(ASV_Daten!A64=\"\",\"\",ASV_Daten!A64)","v":"5c"},{"$f":"IF(ASV_Daten!B64=\"\",\"\",ASV_Daten!B64)","v":"willsch"},{"$f":"IF(ASV_Daten!C64=\"\",\"\",ASV_Daten!C64)","v":"Maria"},{"$f":"IF(ASV_Daten!D64=\"\",\"\",ASV_Daten!D64)","v":2011},{"$f":"IF(ASV_Daten!E64=\"\",\"\",ASV_Daten!E64)","v":"w"},"5cw",{"$f":"IF(ASV_Daten!D55=\"\",\"\",$B$1-ASV_Daten!$D55)","v":11},{"$f":"G65&ASV_Daten!E55","v":"11w"},500,9.9600000000000009,2.36,11.5,{"$f":"IF(ASV_Daten!E55=\"w\",(((800/I65)-2.0232)/0.00647),(((1000/I65)-2.158)/0.006))","v":-65.409582689335394},{"$f":"IF(ASV_Daten!$E55=\"w\",(((50/(J65+0.24))-3.648)/0.0066),IF(ASV_Daten!$E55=\"M\",(((50/(J65+0.24))-3.79)/0.0069),0))","v":189.99405822935225},{"$f":"IF(ASV_Daten!$E55=\"w\",((SQRT(K65)-1.0935)/0.00208),IF(ASV_Daten!$E55=\"m\",((SQRT(K65)-1.15028)/0.00219),0))","v":212.85055267967394},{"$f":"IF(ASV_Daten!E55=\"w\",((SQRT(L65)-2.0232)/0.00874),IF(ASV_Daten!$E55=\"M\",((SQRT(L65)-2.8)/0.011),0))","v":156.51773358840205},559,"T",{"$f":"IF(AND(ASV_Daten!A55=\"1a\",ASV_Daten!E55=\"m\"),\"N1m\",IF(AND(ASV_Daten!A55=\"1a\",ASV_Daten!E55=\"w\"),\"N1w\",IF(AND(ASV_Daten!A55=\"1b\",ASV_Daten!E55=\"w\"),\"N1w\",IF(AND(ASV_Daten!A55=\"1b\",ASV_Daten!E55=\"m\"),\"N1m\",IF(AND(ASV_Daten!A55=\"2a\",ASV_Daten!E55=\"m\"),\"N2m\",IF(AND(ASV_Daten!A55=\"2a\",ASV_Daten!E55=\"w\"),\"N2w\",IF(AND(ASV_Daten!A55=\"2b\",ASV_Daten!E55=\"w\"),\"N2w\",IF(AND(ASV_Daten!A55=\"2b\",ASV_Daten!E55=\"m\"),\"N2m\",IF(AND(ASV_Daten!A55=\"3a\",ASV_Daten!E55=\"m\"),\"N3m\",IF(AND(ASV_Daten!A55=\"3a\",ASV_Daten!E55=\"w\"),\"N3w\",IF(AND(ASV_Daten!A55=\"3b\",ASV_Daten!E55=\"w\"),\"N3w\",IF(AND(ASV_Daten!A55=\"3b\",ASV_Daten!E55=\"m\"),\"N3m\",IF(AND(ASV_Daten!A55=\"4a\",ASV_Daten!E55=\"m\"),\"N4m\",IF(AND(ASV_Daten!A55=\"4a\",ASV_Daten!E55=\"w\"),\"N4w\",IF(AND(ASV_Daten!A55=\"4b\",ASV_Daten!E55=\"m\"),\"N4m\",IF(AND(ASV_Daten!A55=\"4b\",ASV_Daten!E55=\"w\"),\"N4w\"))))))))))))))))","v":false},"nix"]
[{"$f":"IF(ASV_Daten!A65=\"\",\"\",ASV_Daten!A65)","v":"5c"},{"$f":"IF(ASV_Daten!B65=\"\",\"\",ASV_Daten!B65)","v":"woodstock"},{"$f":"IF(ASV_Daten!C65=\"\",\"\",ASV_Daten!C65)","v":"Neele"},{"$f":"IF(ASV_Daten!D65=\"\",\"\",ASV_Daten!D65)","v":2011},{"$f":"IF(ASV_Daten!E65=\"\",\"\",ASV_Daten!E65)","v":"w"},"5cw",{"$f":"IF(ASV_Daten!D57=\"\",\"\",$B$1-ASV_Daten!$D57)","v":10},{"$f":"G66&ASV_Daten!E57","v":"10w"},500,9.56,2.86,7,{"$f":"IF(ASV_Daten!E57=\"w\",(((800/I66)-2.0232)/0.00647),(((1000/I66)-2.158)/0.006))","v":-65.409582689335394},{"$f":"IF(ASV_Daten!$E57=\"w\",(((50/(J66+0.24))-3.648)/0.0066),IF(ASV_Daten!$E57=\"M\",(((50/(J66+0.24))-3.79)/0.0069),0))","v":220.30921459492885},{"$f":"IF(ASV_Daten!$E57=\"w\",((SQRT(K66)-1.0935)/0.00208),IF(ASV_Daten!$E57=\"m\",((SQRT(K66)-1.15028)/0.00219),0))","v":287.33339063883483},{"$f":"IF(ASV_Daten!E57=\"w\",((SQRT(L66)-2.0232)/0.00874),IF(ASV_Daten!$E57=\"M\",((SQRT(L66)-2.8)/0.011),0))","v":71.230127124095034},579,"T",{"$f":"IF(AND(ASV_Daten!A57=\"1a\",ASV_Daten!E57=\"m\"),\"N1m\",IF(AND(ASV_Daten!A57=\"1a\",ASV_Daten!E57=\"w\"),\"N1w\",IF(AND(ASV_Daten!A57=\"1b\",ASV_Daten!E57=\"w\"),\"N1w\",IF(AND(ASV_Daten!A57=\"1b\",ASV_Daten!E57=\"m\"),\"N1m\",IF(AND(ASV_Daten!A57=\"2a\",ASV_Daten!E57=\"m\"),\"N2m\",IF(AND(ASV_Daten!A57=\"2a\",ASV_Daten!E57=\"w\"),\"N2w\",IF(AND(ASV_Daten!A57=\"2b\",ASV_Daten!E57=\"w\"),\"N2w\",IF(AND(ASV_Daten!A57=\"2b\",ASV_Daten!E57=\"m\"),\"N2m\",IF(AND(ASV_Daten!A57=\"3a\",ASV_Daten!E57=\"m\"),\"N3m\",IF(AND(ASV_Daten!A57=\"3a\",ASV_Daten!E57=\"w\"),\"N3w\",IF(AND(ASV_Daten!A57=\"3b\",ASV_Daten!E57=\"w\"),\"N3w\",IF(AND(ASV_Daten!A57=\"3b\",ASV_Daten!E57=\"m\"),\"N3m\",IF(AND(ASV_Daten!A57=\"4a\",ASV_Daten!E57=\"m\"),\"N4m\",IF(AND(ASV_Daten!A57=\"4a\",ASV_Daten!E57=\"w\"),\"N4w\",IF(AND(ASV_Daten!A57=\"4b\",ASV_Daten!E57=\"m\"),\"N4m\",IF(AND(ASV_Daten!A57=\"4b\",ASV_Daten!E57=\"w\"),\"N4w\"))))))))))))))))","v":false},"nix"]
[{"$f":"IF(ASV_Daten!A66=\"\",\"\",ASV_Daten!A66)","v":"5c"},{"$f":"IF(ASV_Daten!B66=\"\",\"\",ASV_Daten!B66)","v":"Klassen"},{"$f":"IF(ASV_Daten!C66=\"\",\"\",ASV_Daten!C66)","v":"Leonie"},{"$f":"IF(ASV_Daten!D66=\"\",\"\",ASV_Daten!D66)","v":2010},{"$f":"IF(ASV_Daten!E66=\"\",\"\",ASV_Daten!E66)","v":"w"},"5cw",{"$f":"IF(ASV_Daten!D58=\"\",\"\",$B$1-ASV_Daten!$D58)","v":11},{"$f":"G67&ASV_Daten!E58","v":"11w"},500,9.15,2.56,7.5,{"$f":"IF(ASV_Daten!E58=\"w\",(((800/I67)-2.0232)/0.00647),(((1000/I67)-2.158)/0.006))","v":-65.409582689335394},{"$f":"IF(ASV_Daten!$E58=\"w\",(((50/(J67+0.24))-3.648)/0.0066),IF(ASV_Daten!$E58=\"M\",(((50/(J67+0.24))-3.79)/0.0069),0))","v":254.06267144286301},{"$f":"IF(ASV_Daten!$E58=\"w\",((SQRT(K67)-1.0935)/0.00208),IF(ASV_Daten!$E58=\"m\",((SQRT(K67)-1.15028)/0.00219),0))","v":243.5096153846155},{"$f":"IF(ASV_Daten!E58=\"w\",((SQRT(L67)-2.0232)/0.00874),IF(ASV_Daten!$E58=\"M\",((SQRT(L67)-2.8)/0.011),0))","v":81.855010014397081},{"$f":"ROUND((SUM(M67:P67)-MIN(M67:P67)),0)","v":579},{"$f":"IF(H67=\"7w\",VLOOKUP(Q67,weiblich8,2),IF(H67=\"7m\",VLOOKUP(Q67,männlich8,2),IF(H67=\"8w\",VLOOKUP(Q67,weiblich8,2),IF(H67=\"8m\",VLOOKUP(Q67,männlich8,2),IF(H67=\"9w\",VLOOKUP(Q67,weiblich9,2),IF(H67=\"9m\",VLOOKUP(Q67,männlich9,2),IF(H67=\"10w\",VLOOKUP(Q67,weiblich10,2),IF(H67=\"10m\",VLOOKUP(Q67,männlich10,2),IF(H67=\"11w\",VLOOKUP(Q67,weiblich11,2),IF(H67=\"11m\",VLOOKUP(Q67,männlich11,2),IF(H67=\"12w\",VLOOKUP(Q67,weiblich12,2),IF(H67=\"12m\",VLOOKUP(Q67,männlich12,2),\"H\"))))))))))))","v":"T"},{"$f":"IF(AND(ASV_Daten!A58=\"1a\",ASV_Daten!E58=\"m\"),\"N1m\",IF(AND(ASV_Daten!A58=\"1a\",ASV_Daten!E58=\"w\"),\"N1w\",IF(AND(ASV_Daten!A58=\"1b\",ASV_Daten!E58=\"w\"),\"N1w\",IF(AND(ASV_Daten!A58=\"1b\",ASV_Daten!E58=\"m\"),\"N1m\",IF(AND(ASV_Daten!A58=\"2a\",ASV_Daten!E58=\"m\"),\"N2m\",IF(AND(ASV_Daten!A58=\"2a\",ASV_Daten!E58=\"w\"),\"N2w\",IF(AND(ASV_Daten!A58=\"2b\",ASV_Daten!E58=\"w\"),\"N2w\",IF(AND(ASV_Daten!A58=\"2b\",ASV_Daten!E58=\"m\"),\"N2m\",IF(AND(ASV_Daten!A58=\"3a\",ASV_Daten!E58=\"m\"),\"N3m\",IF(AND(ASV_Daten!A58=\"3a\",ASV_Daten!E58=\"w\"),\"N3w\",IF(AND(ASV_Daten!A58=\"3b\",ASV_Daten!E58=\"w\"),\"N3w\",IF(AND(ASV_Daten!A58=\"3b\",ASV_Daten!E58=\"m\"),\"N3m\",IF(AND(ASV_Daten!A58=\"4a\",ASV_Daten!E58=\"m\"),\"N4m\",IF(AND(ASV_Daten!A58=\"4a\",ASV_Daten!E58=\"w\"),\"N4w\",IF(AND(ASV_Daten!A58=\"4b\",ASV_Daten!E58=\"m\"),\"N4m\",IF(AND(ASV_Daten!A58=\"4b\",ASV_Daten!E58=\"w\"),\"N4w\"))))))))))))))))","v":false},{"$f":"IF(S67=\"n1m\",VLOOKUP(Q67,N1m,2),IF(S67=\"N1w\",VLOOKUP(Q67,N1w,2),IF(S67=\"N2m\",VLOOKUP(Q67,n2m,2),IF(S67=\"N2w\",VLOOKUP(Q67,n2w,2),IF(S67=\"N3w\",VLOOKUP(Q67,n3w,2),IF(S67=\"N3m\",VLOOKUP(Q67,n3m,2),IF(S67=\"N4w\",VLOOKUP(Q67,n4w,2),IF(S67=\"N4m\",VLOOKUP(Q67,n4m,2),\"nix\"))))))))","v":"nix"}]
[{"$f":"IF(ASV_Daten!A67=\"\",\"\",ASV_Daten!A67)","v":"5c"},{"$f":"IF(ASV_Daten!B67=\"\",\"\",ASV_Daten!B67)","v":"Moll"},{"$f":"IF(ASV_Daten!C67=\"\",\"\",ASV_Daten!C67)","v":"Quirinia"},{"$f":"IF(ASV_Daten!D67=\"\",\"\",ASV_Daten!D67)","v":2011},{"$f":"IF(ASV_Daten!E67=\"\",\"\",ASV_Daten!E67)","v":"w"},"5cw",{"$f":"IF(ASV_Daten!D59=\"\",\"\",$B$1-ASV_Daten!$D59)","v":11},{"$f":"G68&ASV_Daten!E59","v":"11w"},500,10,2.7,10,{"$f":"IF(ASV_Daten!E59=\"w\",(((800/I68)-2.0232)/0.00647),(((1000/I68)-2.158)/0.006))","v":-65.409582689335394},{"$f":"IF(ASV_Daten!$E59=\"w\",(((50/(J68+0.24))-3.648)/0.0066),IF(ASV_Daten!$E59=\"M\",(((50/(J68+0.24))-3.79)/0.0069),0))","v":187.092803030303},{"$f":"IF(ASV_Daten!$E59=\"w\",((SQRT(K68)-1.0935)/0.00208),IF(ASV_Daten!$E59=\"m\",((SQRT(K68)-1.15028)/0.00219),0))","v":264.26330409398969},{"$f":"IF(ASV_Daten!E59=\"w\",((SQRT(L68)-2.0232)/0.00874),IF(ASV_Daten!$E59=\"M\",((SQRT(L68)-2.8)/0.011),0))","v":130.32925173551251},582,"T",{"$f":"IF(AND(ASV_Daten!A59=\"1a\",ASV_Daten!E59=\"m\"),\"N1m\",IF(AND(ASV_Daten!A59=\"1a\",ASV_Daten!E59=\"w\"),\"N1w\",IF(AND(ASV_Daten!A59=\"1b\",ASV_Daten!E59=\"w\"),\"N1w\",IF(AND(ASV_Daten!A59=\"1b\",ASV_Daten!E59=\"m\"),\"N1m\",IF(AND(ASV_Daten!A59=\"2a\",ASV_Daten!E59=\"m\"),\"N2m\",IF(AND(ASV_Daten!A59=\"2a\",ASV_Daten!E59=\"w\"),\"N2w\",IF(AND(ASV_Daten!A59=\"2b\",ASV_Daten!E59=\"w\"),\"N2w\",IF(AND(ASV_Daten!A59=\"2b\",ASV_Daten!E59=\"m\"),\"N2m\",IF(AND(ASV_Daten!A59=\"3a\",ASV_Daten!E59=\"m\"),\"N3m\",IF(AND(ASV_Daten!A59=\"3a\",ASV_Daten!E59=\"w\"),\"N3w\",IF(AND(ASV_Daten!A59=\"3b\",ASV_Daten!E59=\"w\"),\"N3w\",IF(AND(ASV_Daten!A59=\"3b\",ASV_Daten!E59=\"m\"),\"N3m\",IF(AND(ASV_Daten!A59=\"4a\",ASV_Daten!E59=\"m\"),\"N4m\",IF(AND(ASV_Daten!A59=\"4a\",ASV_Daten!E59=\"w\"),\"N4w\",IF(AND(ASV_Daten!A59=\"4b\",ASV_Daten!E59=\"m\"),\"N4m\",IF(AND(ASV_Daten!A59=\"4b\",ASV_Daten!E59=\"w\"),\"N4w\"))))))))))))))))","v":false},"nix"]
[{"$f":"IF(ASV_Daten!A68=\"\",\"\",ASV_Daten!A68)","v":"5c"},{"$f":"IF(ASV_Daten!B68=\"\",\"\",ASV_Daten!B68)","v":"Salger"},{"$f":"IF(ASV_Daten!C68=\"\",\"\",ASV_Daten!C68)","v":"Stephanie"},{"$f":"IF(ASV_Daten!D68=\"\",\"\",ASV_Daten!D68)","v":2011},{"$f":"IF(ASV_Daten!E68=\"\",\"\",ASV_Daten!E68)","v":"w"},{"$f":"A69&E69","v":"5cw"},{"$f":"IF(ASV_Daten!D60=\"\",\"\",$B$1-ASV_Daten!$D60)","v":10},{"$f":"G69&ASV_Daten!E60","v":"10w"},500,9.56,2.6,10,{"$f":"IF(ASV_Daten!E60=\"w\",(((800/I69)-2.0232)/0.00647),(((1000/I69)-2.158)/0.006))","v":-65.409582689335394},{"$f":"IF(ASV_Daten!$E60=\"w\",(((50/(J69+0.24))-3.648)/0.0066),IF(ASV_Daten!$E60=\"M\",(((50/(J69+0.24))-3.79)/0.0069),0))","v":220.30921459492885},{"$f":"IF(ASV_Daten!$E60=\"w\",((SQRT(K69)-1.0935)/0.00208),IF(ASV_Daten!$E60=\"m\",((SQRT(K69)-1.15028)/0.00219),0))","v":249.49593733639912},{"$f":"IF(ASV_Daten!E60=\"w\",((SQRT(L69)-2.0232)/0.00874),IF(ASV_Daten!$E60=\"M\",((SQRT(L69)-2.8)/0.011),0))","v":130.32925173551251},600,"T",{"$f":"IF(AND(ASV_Daten!A60=\"1a\",ASV_Daten!E60=\"m\"),\"N1m\",IF(AND(ASV_Daten!A60=\"1a\",ASV_Daten!E60=\"w\"),\"N1w\",IF(AND(ASV_Daten!A60=\"1b\",ASV_Daten!E60=\"w\"),\"N1w\",IF(AND(ASV_Daten!A60=\"1b\",ASV_Daten!E60=\"m\"),\"N1m\",IF(AND(ASV_Daten!A60=\"2a\",ASV_Daten!E60=\"m\"),\"N2m\",IF(AND(ASV_Daten!A60=\"2a\",ASV_Daten!E60=\"w\"),\"N2w\",IF(AND(ASV_Daten!A60=\"2b\",ASV_Daten!E60=\"w\"),\"N2w\",IF(AND(ASV_Daten!A60=\"2b\",ASV_Daten!E60=\"m\"),\"N2m\",IF(AND(ASV_Daten!A60=\"3a\",ASV_Daten!E60=\"m\"),\"N3m\",IF(AND(ASV_Daten!A60=\"3a\",ASV_Daten!E60=\"w\"),\"N3w\",IF(AND(ASV_Daten!A60=\"3b\",ASV_Daten!E60=\"w\"),\"N3w\",IF(AND(ASV_Daten!A60=\"3b\",ASV_Daten!E60=\"m\"),\"N3m\",IF(AND(ASV_Daten!A60=\"4a\",ASV_Daten!E60=\"m\"),\"N4m\",IF(AND(ASV_Daten!A60=\"4a\",ASV_Daten!E60=\"w\"),\"N4w\",IF(AND(ASV_Daten!A60=\"4b\",ASV_Daten!E60=\"m\"),\"N4m\",IF(AND(ASV_Daten!A60=\"4b\",ASV_Daten!E60=\"w\"),\"N4w\"))))))))))))))))","v":false},"nix"]
[{"$f":"IF(ASV_Daten!A69=\"\",\"\",ASV_Daten!A69)","v":"5c"},{"$f":"IF(ASV_Daten!B69=\"\",\"\",ASV_Daten!B69)","v":"Steinhart"},{"$f":"IF(ASV_Daten!C69=\"\",\"\",ASV_Daten!C69)","v":"Philippa"},{"$f":"IF(ASV_Daten!D69=\"\",\"\",ASV_Daten!D69)","v":2011},{"$f":"IF(ASV_Daten!E69=\"\",\"\",ASV_Daten!E69)","v":"w"},"5cw",{"$f":"IF(ASV_Daten!D62=\"\",\"\",$B$1-ASV_Daten!$D62)","v":10},{"$f":"G70&ASV_Daten!E62","v":"10w"},500,10.4,2.86,13,{"$f":"IF(ASV_Daten!E62=\"w\",(((800/I70)-2.0232)/0.00647),(((1000/I70)-2.158)/0.006))","v":-65.409582689335394},{"$f":"IF(ASV_Daten!$E62=\"w\",(((50/(J70+0.24))-3.648)/0.0066),IF(ASV_Daten!$E62=\"M\",(((50/(J70+0.24))-3.79)/0.0069),0))","v":159.28001822738656},{"$f":"IF(ASV_Daten!$E62=\"w\",((SQRT(K70)-1.0935)/0.00208),IF(ASV_Daten!$E62=\"m\",((SQRT(K70)-1.15028)/0.00219),0))","v":287.33339063883483},{"$f":"IF(ASV_Daten!E62=\"w\",((SQRT(L70)-2.0232)/0.00874),IF(ASV_Daten!$E62=\"M\",((SQRT(L70)-2.8)/0.011),0))","v":181.04705668924362},628,"S",{"$f":"IF(AND(ASV_Daten!A62=\"1a\",ASV_Daten!E62=\"m\"),\"N1m\",IF(AND(ASV_Daten!A62=\"1a\",ASV_Daten!E62=\"w\"),\"N1w\",IF(AND(ASV_Daten!A62=\"1b\",ASV_Daten!E62=\"w\"),\"N1w\",IF(AND(ASV_Daten!A62=\"1b\",ASV_Daten!E62=\"m\"),\"N1m\",IF(AND(ASV_Daten!A62=\"2a\",ASV_Daten!E62=\"m\"),\"N2m\",IF(AND(ASV_Daten!A62=\"2a\",ASV_Daten!E62=\"w\"),\"N2w\",IF(AND(ASV_Daten!A62=\"2b\",ASV_Daten!E62=\"w\"),\"N2w\",IF(AND(ASV_Daten!A62=\"2b\",ASV_Daten!E62=\"m\"),\"N2m\",IF(AND(ASV_Daten!A62=\"3a\",ASV_Daten!E62=\"m\"),\"N3m\",IF(AND(ASV_Daten!A62=\"3a\",ASV_Daten!E62=\"w\"),\"N3w\",IF(AND(ASV_Daten!A62=\"3b\",ASV_Daten!E62=\"w\"),\"N3w\",IF(AND(ASV_Daten!A62=\"3b\",ASV_Daten!E62=\"m\"),\"N3m\",IF(AND(ASV_Daten!A62=\"4a\",ASV_Daten!E62=\"m\"),\"N4m\",IF(AND(ASV_Daten!A62=\"4a\",ASV_Daten!E62=\"w\"),\"N4w\",IF(AND(ASV_Daten!A62=\"4b\",ASV_Daten!E62=\"m\"),\"N4m\",IF(AND(ASV_Daten!A62=\"4b\",ASV_Daten!E62=\"w\"),\"N4w\"))))))))))))))))","v":false},"nix"]
[{"$f":"IF(ASV_Daten!A70=\"\",\"\",ASV_Daten!A70)","v":"5c"},{"$f":"IF(ASV_Daten!B70=\"\",\"\",ASV_Daten!B70)","v":"wein"},{"$f":"IF(ASV_Daten!C70=\"\",\"\",ASV_Daten!C70)","v":"Daniela"},{"$f":"IF(ASV_Daten!D70=\"\",\"\",ASV_Daten!D70)","v":2011},{"$f":"IF(ASV_Daten!E70=\"\",\"\",ASV_Daten!E70)","v":"w"},"5cw",{"$f":"IF(ASV_Daten!D63=\"\",\"\",$B$1-ASV_Daten!$D63)","v":10},{"$f":"G71&ASV_Daten!E63","v":"10w"},500,9.84,2.78,11.5,{"$f":"IF(ASV_Daten!E63=\"w\",(((800/I71)-2.0232)/0.00647),(((1000/I71)-2.158)/0.006))","v":-65.409582689335394},{"$f":"IF(ASV_Daten!$E63=\"w\",(((50/(J71+0.24))-3.648)/0.0066),IF(ASV_Daten!$E63=\"M\",(((50/(J71+0.24))-3.79)/0.0069),0))","v":198.83597883597884},{"$f":"IF(ASV_Daten!$E63=\"w\",((SQRT(K71)-1.0935)/0.00208),IF(ASV_Daten!$E63=\"m\",((SQRT(K71)-1.15028)/0.00219),0))","v":275.88134617947435},{"$f":"IF(ASV_Daten!E63=\"w\",((SQRT(L71)-2.0232)/0.00874),IF(ASV_Daten!$E63=\"M\",((SQRT(L71)-2.8)/0.011),0))","v":156.51773358840205},631,"S",{"$f":"IF(AND(ASV_Daten!A63=\"1a\",ASV_Daten!E63=\"m\"),\"N1m\",IF(AND(ASV_Daten!A63=\"1a\",ASV_Daten!E63=\"w\"),\"N1w\",IF(AND(ASV_Daten!A63=\"1b\",ASV_Daten!E63=\"w\"),\"N1w\",IF(AND(ASV_Daten!A63=\"1b\",ASV_Daten!E63=\"m\"),\"N1m\",IF(AND(ASV_Daten!A63=\"2a\",ASV_Daten!E63=\"m\"),\"N2m\",IF(AND(ASV_Daten!A63=\"2a\",ASV_Daten!E63=\"w\"),\"N2w\",IF(AND(ASV_Daten!A63=\"2b\",ASV_Daten!E63=\"w\"),\"N2w\",IF(AND(ASV_Daten!A63=\"2b\",ASV_Daten!E63=\"m\"),\"N2m\",IF(AND(ASV_Daten!A63=\"3a\",ASV_Daten!E63=\"m\"),\"N3m\",IF(AND(ASV_Daten!A63=\"3a\",ASV_Daten!E63=\"w\"),\"N3w\",IF(AND(ASV_Daten!A63=\"3b\",ASV_Daten!E63=\"w\"),\"N3w\",IF(AND(ASV_Daten!A63=\"3b\",ASV_Daten!E63=\"m\"),\"N3m\",IF(AND(ASV_Daten!A63=\"4a\",ASV_Daten!E63=\"m\"),\"N4m\",IF(AND(ASV_Daten!A63=\"4a\",ASV_Daten!E63=\"w\"),\"N4w\",IF(AND(ASV_Daten!A63=\"4b\",ASV_Daten!E63=\"m\"),\"N4m\",IF(AND(ASV_Daten!A63=\"4b\",ASV_Daten!E63=\"w\"),\"N4w\"))))))))))))))))","v":false},"nix"]
[{"$f":"IF(ASV_Daten!A71=\"\",\"\",ASV_Daten!A71)","v":"5c"},{"$f":"IF(ASV_Daten!B71=\"\",\"\",ASV_Daten!B71)","v":"willsch"},{"$f":"IF(ASV_Daten!C71=\"\",\"\",ASV_Daten!C71)","v":"Maria"},{"$f":"IF(ASV_Daten!D71=\"\",\"\",ASV_Daten!D71)","v":2011},{"$f":"IF(ASV_Daten!E71=\"\",\"\",ASV_Daten!E71)","v":"w"},"5cw",{"$f":"IF(ASV_Daten!D66=\"\",\"\",$B$1-ASV_Daten!$D66)","v":11},{"$f":"G72&ASV_Daten!E66","v":"11w"},500,11.81,1.7,9.5,{"$f":"IF(ASV_Daten!E66=\"w\",(((800/I72)-2.0232)/0.00647),(((1000/I72)-2.158)/0.006))","v":-65.409582689335394},{"$f":"IF(ASV_Daten!$E66=\"w\",(((50/(J72+0.24))-3.648)/0.0066),IF(ASV_Daten!$E66=\"M\",(((50/(J72+0.24))-3.79)/0.0069),0))","v":75.966302024393215},{"$f":"IF(ASV_Daten!$E66=\"w\",((SQRT(K72)-1.0935)/0.00208),IF(ASV_Daten!$E66=\"m\",((SQRT(K72)-1.15028)/0.00219),0))","v":101.1252312694855},{"$f":"IF(ASV_Daten!E66=\"w\",((SQRT(L72)-2.0232)/0.00874),IF(ASV_Daten!$E66=\"M\",((SQRT(L72)-2.8)/0.011),0))","v":121.16784914010159},298,"T",{"$f":"IF(AND(ASV_Daten!A66=\"1a\",ASV_Daten!E66=\"m\"),\"N1m\",IF(AND(ASV_Daten!A66=\"1a\",ASV_Daten!E66=\"w\"),\"N1w\",IF(AND(ASV_Daten!A66=\"1b\",ASV_Daten!E66=\"w\"),\"N1w\",IF(AND(ASV_Daten!A66=\"1b\",ASV_Daten!E66=\"m\"),\"N1m\",IF(AND(ASV_Daten!A66=\"2a\",ASV_Daten!E66=\"m\"),\"N2m\",IF(AND(ASV_Daten!A66=\"2a\",ASV_Daten!E66=\"w\"),\"N2w\",IF(AND(ASV_Daten!A66=\"2b\",ASV_Daten!E66=\"w\"),\"N2w\",IF(AND(ASV_Daten!A66=\"2b\",ASV_Daten!E66=\"m\"),\"N2m\",IF(AND(ASV_Daten!A66=\"3a\",ASV_Daten!E66=\"m\"),\"N3m\",IF(AND(ASV_Daten!A66=\"3a\",ASV_Daten!E66=\"w\"),\"N3w\",IF(AND(ASV_Daten!A66=\"3b\",ASV_Daten!E66=\"w\"),\"N3w\",IF(AND(ASV_Daten!A66=\"3b\",ASV_Daten!E66=\"m\"),\"N3m\",IF(AND(ASV_Daten!A66=\"4a\",ASV_Daten!E66=\"m\"),\"N4m\",IF(AND(ASV_Daten!A66=\"4a\",ASV_Daten!E66=\"w\"),\"N4w\",IF(AND(ASV_Daten!A66=\"4b\",ASV_Daten!E66=\"m\"),\"N4m\",IF(AND(ASV_Daten!A66=\"4b\",ASV_Daten!E66=\"w\"),\"N4w\"))))))))))))))))","v":false},"nix"]
[{"$f":"IF(ASV_Daten!A72=\"\",\"\",ASV_Daten!A72)","v":"5c"},{"$f":"IF(ASV_Daten!B72=\"\",\"\",ASV_Daten!B72)","v":"woodstock"},{"$f":"IF(ASV_Daten!C72=\"\",\"\",ASV_Daten!C72)","v":"Neele"},{"$f":"IF(ASV_Daten!D72=\"\",\"\",ASV_Daten!D72)","v":2011},{"$f":"IF(ASV_Daten!E72=\"\",\"\",ASV_Daten!E72)","v":"w"},"5cw",{"$f":"IF(ASV_Daten!D72=\"\",\"\",$B$1-ASV_Daten!$D72)","v":10},{"$f":"G73&ASV_Daten!E72","v":"10w"},354,11.07,2.5,9.5,{"$f":"IF(ASV_Daten!E72=\"w\",(((800/I73)-2.0232)/0.00647),(((1000/I73)-2.158)/0.006))","v":36.582226530095433},{"$f":"IF(ASV_Daten!$E72=\"w\",(((50/(J73+0.24))-3.648)/0.0066),IF(ASV_Daten!$E72=\"M\",(((50/(J73+0.24))-3.79)/0.0069),0))","v":117.10098330787984},{"$f":"IF(ASV_Daten!$E72=\"w\",((SQRT(K73)-1.0935)/0.00208),IF(ASV_Daten!$E72=\"m\",((SQRT(K73)-1.15028)/0.00219),0))","v":234.4417452327836},{"$f":"IF(ASV_Daten!E72=\"w\",((SQRT(L73)-2.0232)/0.00874),IF(ASV_Daten!$E72=\"M\",((SQRT(L73)-2.8)/0.011),0))","v":121.16784914010159},473,"T",{"$f":"IF(AND(ASV_Daten!A72=\"1a\",ASV_Daten!E72=\"m\"),\"N1m\",IF(AND(ASV_Daten!A72=\"1a\",ASV_Daten!E72=\"w\"),\"N1w\",IF(AND(ASV_Daten!A72=\"1b\",ASV_Daten!E72=\"w\"),\"N1w\",IF(AND(ASV_Daten!A72=\"1b\",ASV_Daten!E72=\"m\"),\"N1m\",IF(AND(ASV_Daten!A72=\"2a\",ASV_Daten!E72=\"m\"),\"N2m\",IF(AND(ASV_Daten!A72=\"2a\",ASV_Daten!E72=\"w\"),\"N2w\",IF(AND(ASV_Daten!A72=\"2b\",ASV_Daten!E72=\"w\"),\"N2w\",IF(AND(ASV_Daten!A72=\"2b\",ASV_Daten!E72=\"m\"),\"N2m\",IF(AND(ASV_Daten!A72=\"3a\",ASV_Daten!E72=\"m\"),\"N3m\",IF(AND(ASV_Daten!A72=\"3a\",ASV_Daten!E72=\"w\"),\"N3w\",IF(AND(ASV_Daten!A72=\"3b\",ASV_Daten!E72=\"w\"),\"N3w\",IF(AND(ASV_Daten!A72=\"3b\",ASV_Daten!E72=\"m\"),\"N3m\",IF(AND(ASV_Daten!A72=\"4a\",ASV_Daten!E72=\"m\"),\"N4m\",IF(AND(ASV_Daten!A72=\"4a\",ASV_Daten!E72=\"w\"),\"N4w\",IF(AND(ASV_Daten!A72=\"4b\",ASV_Daten!E72=\"m\"),\"N4m\",IF(AND(ASV_Daten!A72=\"4b\",ASV_Daten!E72=\"w\"),\"N4w\"))))))))))))))))","v":false},"nix"]
[{"$f":"IF(ASV_Daten!A73=\"\",\"\",ASV_Daten!A73)","v":"5c"},{"$f":"IF(ASV_Daten!B73=\"\",\"\",ASV_Daten!B73)","v":"Klassen"},{"$f":"IF(ASV_Daten!C73=\"\",\"\",ASV_Daten!C73)","v":"Leonie"},{"$f":"IF(ASV_Daten!D73=\"\",\"\",ASV_Daten!D73)","v":2010},{"$f":"IF(ASV_Daten!E73=\"\",\"\",ASV_Daten!E73)","v":"w"},"5cw",{"$f":"IF(D74=\"\",\"\",$B$1-$D74)","v":11},{"$f":"G74&E74","v":"11w"},343,11.19,2.64,11,{"$f":"IF(E74=\"w\",(((800/I74)-2.0232)/0.00647),(((1000/I74)-2.158)/0.006))","v":47.783851010044117},{"$f":"IF($E74=\"w\",(((50/(J74+0.24))-3.648)/0.0066),IF($E74=\"M\",(((50/(J74+0.24))-3.79)/0.0069),0))","v":110.06866565921683},{"$f":"IF($E74=\"w\",((SQRT(K74)-1.0935)/0.00208),IF($E74=\"m\",((SQRT(K74)-1.15028)/0.00219),0))","v":255.43638506115011},{"$f":"IF(E74=\"w\",((SQRT(L74)-2.0232)/0.00874),IF($E74=\"M\",((SQRT(L74)-2.8)/0.011),0))","v":147.98910644798625},513,"T",{"$f":"IF(AND(A74=\"1a\",E74=\"m\"),\"N1m\",IF(AND(A74=\"1a\",E74=\"w\"),\"N1w\",IF(AND(A74=\"1b\",E74=\"w\"),\"N1w\",IF(AND(A74=\"1b\",E74=\"m\"),\"N1m\",IF(AND(A74=\"2a\",E74=\"m\"),\"N2m\",IF(AND(A74=\"2a\",E74=\"w\"),\"N2w\",IF(AND(A74=\"2b\",E74=\"w\"),\"N2w\",IF(AND(A74=\"2b\",E74=\"m\"),\"N2m\",IF(AND(A74=\"3a\",E74=\"m\"),\"N3m\",IF(AND(A74=\"3a\",E74=\"w\"),\"N3w\",IF(AND(A74=\"3b\",E74=\"w\"),\"N3w\",IF(AND(A74=\"3b\",E74=\"m\"),\"N3m\",IF(AND(A74=\"4a\",E74=\"m\"),\"N4m\",IF(AND(A74=\"4a\",E74=\"w\"),\"N4w\",IF(AND(A74=\"4b\",E74=\"m\"),\"N4m\",IF(AND(A74=\"4b\",E74=\"w\"),\"N4w\"))))))))))))))))","v":false},"nix"]
[{"$f":"IF(ASV_Daten!A74=\"\",\"\",ASV_Daten!A74)","v":"5c"},{"$f":"IF(ASV_Daten!B74=\"\",\"\",ASV_Daten!B74)","v":"Moll"},{"$f":"IF(ASV_Daten!C74=\"\",\"\",ASV_Daten!C74)","v":"Quirinia"},{"$f":"IF(ASV_Daten!D74=\"\",\"\",ASV_Daten!D74)","v":2011},{"$f":"IF(ASV_Daten!E74=\"\",\"\",ASV_Daten!E74)","v":"w"},"5cw",10,"10w",334,10.09,2.42,10,57.497616821997376,180.64712957258939,222.18024933192535,130.32925173551251,533,"T",false,"nix"]
[{"$f":"IF(ASV_Daten!A75=\"\",\"\",ASV_Daten!A75)","v":"5c"},{"$f":"IF(ASV_Daten!B75=\"\",\"\",ASV_Daten!B75)","v":"Salger"},{"$f":"IF(ASV_Daten!C75=\"\",\"\",ASV_Daten!C75)","v":"Stephanie"},{"$f":"IF(ASV_Daten!D75=\"\",\"\",ASV_Daten!D75)","v":2011},{"$f":"IF(ASV_Daten!E75=\"\",\"\",ASV_Daten!E75)","v":"w"},"5cw",10,"10w",337,9.69,2.76,14.5,54.202046422887605,210.18889804388294,272.99267912673798,204.19754610205428,687,"S",false,"nix"]
[{"$f":"IF(ASV_Daten!A76=\"\",\"\",ASV_Daten!A76)","v":"5c"},{"$f":"IF(ASV_Daten!B76=\"\",\"\",ASV_Daten!B76)","v":"Steinhart"},{"$f":"IF(ASV_Daten!C76=\"\",\"\",ASV_Daten!C76)","v":"Philippa"},{"$f":"IF(ASV_Daten!D76=\"\",\"\",ASV_Daten!D76)","v":2011},{"$f":"IF(ASV_Daten!E76=\"\",\"\",ASV_Daten!E76)","v":"w"},"5cw",10,"10w",325,9.25,2.8,19.5,67.749375817382003,245.56119679407342,278.75964089814966,273.7620632910668,798,"S",false,"nix"]
[{"$f":"IF(ASV_Daten!A77=\"\",\"\",ASV_Daten!A77)","v":"5c"},{"$f":"IF(ASV_Daten!B77=\"\",\"\",ASV_Daten!B77)","v":"wein"},{"$f":"IF(ASV_Daten!C77=\"\",\"\",ASV_Daten!C77)","v":"Daniela"},{"$f":"IF(ASV_Daten!D77=\"\",\"\",ASV_Daten!D77)","v":2011},{"$f":"IF(ASV_Daten!E77=\"\",\"\",ASV_Daten!E77)","v":"w"},"5cw",10,"10w",276,9.8800000000000008,2.82,10,135.2937750599198,195.86537309857465,281.62767421858973,130.32925173551251,613,"T",false,"nix"]
[{"$f":"IF(ASV_Daten!A78=\"\",\"\",ASV_Daten!A78)","v":"5c"},{"$f":"IF(ASV_Daten!B78=\"\",\"\",ASV_Daten!B78)","v":"willsch"},{"$f":"IF(ASV_Daten!C78=\"\",\"\",ASV_Daten!C78)","v":"Maria"},{"$f":"IF(ASV_Daten!D78=\"\",\"\",ASV_Daten!D78)","v":2011},{"$f":"IF(ASV_Daten!E78=\"\",\"\",ASV_Daten!E78)","v":"w"},"5cw",10,"10w",500,9.44,2.6,13,-65.409582689335394,229.89231154520414,249.49593733639912,181.04705668924362,660,"S",false,"nix"]
[{"$f":"IF(ASV_Daten!A79=\"\",\"\",ASV_Daten!A79)","v":"5c"},{"$f":"IF(ASV_Daten!B79=\"\",\"\",ASV_Daten!B79)","v":"woodstock"},{"$f":"IF(ASV_Daten!C79=\"\",\"\",ASV_Daten!C79)","v":"Neele"},{"$f":"IF(ASV_Daten!D79=\"\",\"\",ASV_Daten!D79)","v":2011},{"$f":"IF(ASV_Daten!E79=\"\",\"\",ASV_Daten!E79)","v":"w"},"5cw",10,"10w",281,9.7799999999999994,2.86,12.5,127.32227031962466,203.33635758785465,287.33339063883483,173.03591601061072,664,"S",false,"nix"]
[{"$f":"IF(ASV_Daten!A80=\"\",\"\",ASV_Daten!A80)","v":"5d"},{"$f":"IF(ASV_Daten!B80=\"\",\"\",ASV_Daten!B80)","v":"Adler"},{"$f":"IF(ASV_Daten!C80=\"\",\"\",ASV_Daten!C80)","v":"Marja"},{"$f":"IF(ASV_Daten!D80=\"\",\"\",ASV_Daten!D80)","v":2011},{"$f":"IF(ASV_Daten!E80=\"\",\"\",ASV_Daten!E80)","v":"w"},"5dw",10,"10w",289,9.44,3.14,17,115.14159041196254,229.89231154520414,326.20409358987268,240.26380155808474,796,"S",false,"nix"]
[{"$f":"IF(ASV_Daten!A81=\"\",\"\",ASV_Daten!A81)","v":"5d"},{"$f":"IF(ASV_Daten!B81=\"\",\"\",ASV_Daten!B81)","v":"Jannowski"},{"$f":"IF(ASV_Daten!C81=\"\",\"\",ASV_Daten!C81)","v":"Sonja"},{"$f":"IF(ASV_Daten!D81=\"\",\"\",ASV_Daten!D81)","v":2011},{"$f":"IF(ASV_Daten!E81=\"\",\"\",ASV_Daten!E81)","v":"w"},"5dw",10,"10w",253,8.9700000000000006,2.6,15,176.02091746033682,269.83055308788204,249.49593733639912,211.64569178574564,731,"S",false,"nix"]
[{"$f":"IF(ASV_Daten!A82=\"\",\"\",ASV_Daten!A82)","v":"5d"},{"$f":"IF(ASV_Daten!B82=\"\",\"\",ASV_Daten!B82)","v":"Lowsano"},{"$f":"IF(ASV_Daten!C82=\"\",\"\",ASV_Daten!C82)","v":"Simon"},{"$f":"IF(ASV_Daten!D82=\"\",\"\",ASV_Daten!D82)","v":2011},{"$f":"IF(ASV_Daten!E82=\"\",\"\",ASV_Daten!E82)","v":"m"},"5dm",10,"10m",305,10.119999999999999,2.5499999999999998,10,186.78142076502735,150.18185887751113,203.9232613091923,32.934332742579976,541,"T",false,"nix"]
[{"$f":"IF(ASV_Daten!A83=\"\",\"\",ASV_Daten!A83)","v":"5d"},{"$f":"IF(ASV_Daten!B83=\"\",\"\",ASV_Daten!B83)","v":"Pretlow"},{"$f":"IF(ASV_Daten!C83=\"\",\"\",ASV_Daten!C83)","v":"Janus"},{"$f":"IF(ASV_Daten!D83=\"\",\"\",ASV_Daten!D83)","v":2011},{"$f":"IF(ASV_Daten!E83=\"\",\"\",ASV_Daten!E83)","v":"m"},"5dm",10,"10m",318,9.7799999999999994,2.66,6.5,164.44234800838578,173.91593624345518,219.48431188584894,-22.771840291237055,558,"T",false,"nix"]
[{"$f":"IF(ASV_Daten!A84=\"\",\"\",ASV_Daten!A84)","v":"5d"},{"$f":"IF(ASV_Daten!B84=\"\",\"\",ASV_Daten!B84)","v":"Schibar"},{"$f":"IF(ASV_Daten!C84=\"\",\"\",ASV_Daten!C84)","v":"Mara"},{"$f":"IF(ASV_Daten!D84=\"\",\"\",ASV_Daten!D84)","v":2011},{"$f":"IF(ASV_Daten!E84=\"\",\"\",ASV_Daten!E84)","v":"w"},"5dw",10,"10w",327,10.16,2.54,11,65.422439015167583,175.71095571095566,240.49891588986674,147.98910644798625,564,"T",false,"nix"]
[{"$f":"IF(ASV_Daten!A85=\"\",\"\",ASV_Daten!A85)","v":"5d"},{"$f":"IF(ASV_Daten!B85=\"\",\"\",ASV_Daten!B85)","v":"Schulze"},{"$f":"IF(ASV_Daten!C85=\"\",\"\",ASV_Daten!C85)","v":"Anjoschka"},{"$f":"IF(ASV_Daten!D85=\"\",\"\",ASV_Daten!D85)","v":2011},{"$f":"IF(ASV_Daten!E85=\"\",\"\",ASV_Daten!E85)","v":"w"},"5dw",10,"10w",361,9,3.22,24,29.809348067149905,267.15991079627435,336.98838677530586,329.03655441262651,933,"E",false,"nix"]
[{"$f":"IF(ASV_Daten!A86=\"\",\"\",ASV_Daten!A86)","v":"5d"},{"$f":"IF(ASV_Daten!B86=\"\",\"\",ASV_Daten!B86)","v":"wlodomar"},{"$f":"IF(ASV_Daten!C86=\"\",\"\",ASV_Daten!C86)","v":"Hermann"},{"$f":"IF(ASV_Daten!D86=\"\",\"\",ASV_Daten!D86)","v":2011},{"$f":"IF(ASV_Daten!E86=\"\",\"\",ASV_Daten!E86)","v":"m"},"5dm",10,"10m",253,9.1199999999999992,2.68,15,299.094861660079,224.91019447541194,222.27879195182197,97.54394056431066,746,"S",false,"nix"]
[{"$f":"IF(ASV_Daten!A87=\"\",\"\",ASV_Daten!A87)","v":"5d"},{"$f":"IF(ASV_Daten!B87=\"\",\"\",ASV_Daten!B87)","v":"Birkus"},{"$f":"IF(ASV_Daten!C87=\"\",\"\",ASV_Daten!C87)","v":"Yvo"},{"$f":"IF(ASV_Daten!D87=\"\",\"\",ASV_Daten!D87)","v":2011},{"$f":"IF(ASV_Daten!E87=\"\",\"\",ASV_Daten!E87)","v":"m"},"5dm",10,"10m",256,9,2.82,13,291.375,234.96455235585663,241.55505131263311,73.231934133089936,768,"S",false,"nix"]
[{"$f":"IF(ASV_Daten!A88=\"\",\"\",ASV_Daten!A88)","v":"5d"},{"$f":"IF(ASV_Daten!B88=\"\",\"\",ASV_Daten!B88)","v":"Adler"},{"$f":"IF(ASV_Daten!C88=\"\",\"\",ASV_Daten!C88)","v":"Marja"},{"$f":"IF(ASV_Daten!D88=\"\",\"\",ASV_Daten!D88)","v":2011},{"$f":"IF(ASV_Daten!E88=\"\",\"\",ASV_Daten!E88)","v":"w"},"5dw",10,"10w",352,9.5299999999999994,2.5,19.5,38.566811858929341,222.6829192642908,234.4417452327836,273.7620632910668,731,"S",false,"nix"]
[{"$f":"IF(ASV_Daten!A89=\"\",\"\",ASV_Daten!A89)","v":"5d"},{"$f":"IF(ASV_Daten!B89=\"\",\"\",ASV_Daten!B89)","v":"Jannowski"},{"$f":"IF(ASV_Daten!C89=\"\",\"\",ASV_Daten!C89)","v":"Sonja"},{"$f":"IF(ASV_Daten!D89=\"\",\"\",ASV_Daten!D89)","v":2011},{"$f":"IF(ASV_Daten!E89=\"\",\"\",ASV_Daten!E89)","v":"w"},"5dw",10,"10w",283,8.34,2.83,9.5,124.21253843507135,330.22815568270119,283.05787698368857,121.16784914010159,737,"S",false,"nix"]
[{"$f":"IF(ASV_Daten!A90=\"\",\"\",ASV_Daten!A90)","v":"5d"},{"$f":"IF(ASV_Daten!B90=\"\",\"\",ASV_Daten!B90)","v":"Lowsano"},{"$f":"IF(ASV_Daten!C90=\"\",\"\",ASV_Daten!C90)","v":"Simon"},{"$f":"IF(ASV_Daten!D90=\"\",\"\",ASV_Daten!D90)","v":2011},{"$f":"IF(ASV_Daten!E90=\"\",\"\",ASV_Daten!E90)","v":"m"},"5dm",10,"10m",327,8.66,3.38,25,150.01732925586137,264.924279433317,314.24549364612943,200.00000000000003,779,"E",false,"nix"]
[{"$f":"IF(ASV_Daten!A91=\"\",\"\",ASV_Daten!A91)","v":"5d"},{"$f":"IF(ASV_Daten!B91=\"\",\"\",ASV_Daten!B91)","v":"Pretlow"},{"$f":"IF(ASV_Daten!C91=\"\",\"\",ASV_Daten!C91)","v":"Janus"},{"$f":"IF(ASV_Daten!D91=\"\",\"\",ASV_Daten!D91)","v":2011},{"$f":"IF(ASV_Daten!E91=\"\",\"\",ASV_Daten!E91)","v":"m"},"5dm",10,"10m",328,8.75,3.24,30.5,148.46341463414635,256.77322629008074,296.67579908675799,247.51640987214827,801,"E",false,"nix"]
[{"$f":"IF(ASV_Daten!A92=\"\",\"\",ASV_Daten!A92)","v":"5d"},{"$f":"IF(ASV_Daten!B92=\"\",\"\",ASV_Daten!B92)","v":"Schibar"},{"$f":"IF(ASV_Daten!C92=\"\",\"\",ASV_Daten!C92)","v":"Mara"},{"$f":"IF(ASV_Daten!D92=\"\",\"\",ASV_Daten!D92)","v":2011},{"$f":"IF(ASV_Daten!E92=\"\",\"\",ASV_Daten!E92)","v":"w"},"5dw",10,"10w",626,18.97,1.7,16.5,-115.18465663593585,-158.36196425472838,101.1252312694855,233.27450827436846,219,"T",false,"nix"]
[{"$f":"IF(ASV_Daten!A93=\"\",\"\",ASV_Daten!A93)","v":"5d"},{"$f":"IF(ASV_Daten!B93=\"\",\"\",ASV_Daten!B93)","v":"Schulze"},{"$f":"IF(ASV_Daten!C93=\"\",\"\",ASV_Daten!C93)","v":"Anjoschka"},{"$f":"IF(ASV_Daten!D93=\"\",\"\",ASV_Daten!D93)","v":2011},{"$f":"IF(ASV_Daten!E93=\"\",\"\",ASV_Daten!E93)","v":"w"},"5dw",10,"10w",373,10.220000000000001,2.84,13,18.790126423874263,171.53253375050684,284.48555511311139,181.04705668924362,637,"S",false,"nix"]
[{"$f":"IF(ASV_Daten!A94=\"\",\"\",ASV_Daten!A94)","v":"5d"},{"$f":"IF(ASV_Daten!B94=\"\",\"\",ASV_Daten!B94)","v":"wlodomar"},{"$f":"IF(ASV_Daten!C94=\"\",\"\",ASV_Daten!C94)","v":"Hermann"},{"$f":"IF(ASV_Daten!D94=\"\",\"\",ASV_Daten!D94)","v":2011},{"$f":"IF(ASV_Daten!E94=\"\",\"\",ASV_Daten!E94)","v":"m"},"5dm",10,"10m",349,10.53,2.8,19.5,117.88825214899715,123.55442520151257,238.83107446034299,146.89822119672039,509,"T",false,"nix"]
[{"$f":"IF(ASV_Daten!A95=\"\",\"\",ASV_Daten!A95)","v":"5d"},{"$f":"IF(ASV_Daten!B95=\"\",\"\",ASV_Daten!B95)","v":"Birkus"},{"$f":"IF(ASV_Daten!C95=\"\",\"\",ASV_Daten!C95)","v":"Yvo"},{"$f":"IF(ASV_Daten!D95=\"\",\"\",ASV_Daten!D95)","v":2011},{"$f":"IF(ASV_Daten!E95=\"\",\"\",ASV_Daten!E95)","v":"m"},"5dm",10,"10m",320,10.4,2.7,19.5,161.16666666666669,131.77508989865962,225.06286416232805,146.89822119672039,533,"T",false,"nix"]
[{"$f":"IF(ASV_Daten!A96=\"\",\"\",ASV_Daten!A96)","v":"5d"},{"$f":"IF(ASV_Daten!B96=\"\",\"\",ASV_Daten!B96)","v":"Adler"},{"$f":"IF(ASV_Daten!C96=\"\",\"\",ASV_Daten!C96)","v":"Marja"},{"$f":"IF(ASV_Daten!D96=\"\",\"\",ASV_Daten!D96)","v":2011},{"$f":"IF(ASV_Daten!E96=\"\",\"\",ASV_Daten!E96)","v":"w"},"5dw",10,"10w",419,10.38,2.6,24,-17.603110371717488,160.62089824801677,249.49593733639912,329.03655441262651,739,"S",false,"nix"]
[{"$f":"IF(ASV_Daten!A97=\"\",\"\",ASV_Daten!A97)","v":"5d"},{"$f":"IF(ASV_Daten!B97=\"\",\"\",ASV_Daten!B97)","v":"Jannowski"},{"$f":"IF(ASV_Daten!C97=\"\",\"\",ASV_Daten!C97)","v":"Sonja"},{"$f":"IF(ASV_Daten!D97=\"\",\"\",ASV_Daten!D97)","v":2011},{"$f":"IF(ASV_Daten!E97=\"\",\"\",ASV_Daten!E97)","v":"w"},"5dw",10,"10w",347,10,2.4,10,43.628362337367307,187.092803030303,219.08333580911872,130.32925173551251,537,"T",false,"nix"]
[{"$f":"IF(ASV_Daten!A98=\"\",\"\",ASV_Daten!A98)","v":"5d"},{"$f":"IF(ASV_Daten!B98=\"\",\"\",ASV_Daten!B98)","v":"Lowsano"},{"$f":"IF(ASV_Daten!C98=\"\",\"\",ASV_Daten!C98)","v":"Simon"},{"$f":"IF(ASV_Daten!D98=\"\",\"\",ASV_Daten!D98)","v":2011},{"$f":"IF(ASV_Daten!E98=\"\",\"\",ASV_Daten!E98)","v":"m"},"5dm",10,"10m",270,9.31,2.74,17,257.61728395061732,209.50754988997645,230.60024462314379,120.28232960160553,{"$f":"ROUND((SUM(M99:P99)-MIN(M99:P99)),0)","v":698},{"$f":"IF(H99=\"7w\",VLOOKUP(Q99,weiblich8,2),IF(H99=\"7m\",VLOOKUP(Q99,männlich8,2),IF(H99=\"8w\",VLOOKUP(Q99,weiblich8,2),IF(H99=\"8m\",VLOOKUP(Q99,männlich8,2),IF(H99=\"9w\",VLOOKUP(Q99,weiblich9,2),IF(H99=\"9m\",VLOOKUP(Q99,männlich9,2),IF(H99=\"10w\",VLOOKUP(Q99,weiblich10,2),IF(H99=\"10m\",VLOOKUP(Q99,männlich10,2),IF(H99=\"11w\",VLOOKUP(Q99,weiblich11,2),IF(H99=\"11m\",VLOOKUP(Q99,männlich11,2),IF(H99=\"12w\",VLOOKUP(Q99,weiblich12,2),IF(H99=\"12m\",VLOOKUP(Q99,männlich12,2),\"H\"))))))))))))","v":"S"},false,{"$f":"IF(S99=\"n1m\",VLOOKUP(Q99,N1m,2),IF(S99=\"N1w\",VLOOKUP(Q99,N1w,2),IF(S99=\"N2m\",VLOOKUP(Q99,n2m,2),IF(S99=\"N2w\",VLOOKUP(Q99,n2w,2),IF(S99=\"N3w\",VLOOKUP(Q99,n3w,2),IF(S99=\"N3m\",VLOOKUP(Q99,n3m,2),IF(S99=\"N4w\",VLOOKUP(Q99,n4w,2),IF(S99=\"N4m\",VLOOKUP(Q99,n4m,2),\"nix\"))))))))","v":"nix"}]
[{"$f":"IF(ASV_Daten!A99=\"\",\"\",ASV_Daten!A99)","v":"5d"},{"$f":"IF(ASV_Daten!B99=\"\",\"\",ASV_Daten!B99)","v":"Pretlow"},{"$f":"IF(ASV_Daten!C99=\"\",\"\",ASV_Daten!C99)","v":"Janus"},{"$f":"IF(ASV_Daten!D99=\"\",\"\",ASV_Daten!D99)","v":2011},{"$f":"IF(ASV_Daten!E99=\"\",\"\",ASV_Daten!E99)","v":"m"},"5dm",10,"10m",282,8.91,3.16,20,231.34988179669028,242.67838758216519,286.46524359046475,152.01235954541636,760,"S",false,"nix"]
[{"$f":"IF(ASV_Daten!A100=\"\",\"\",ASV_Daten!A100)","v":"5d"},{"$f":"IF(ASV_Daten!B100=\"\",\"\",ASV_Daten!B100)","v":"Schibar"},{"$f":"IF(ASV_Daten!C100=\"\",\"\",ASV_Daten!C100)","v":"Mara"},{"$f":"IF(ASV_Daten!D100=\"\",\"\",ASV_Daten!D100)","v":2011},{"$f":"IF(ASV_Daten!E100=\"\",\"\",ASV_Daten!E100)","v":"w"},"5dw",10,"10w",500,8.09,3.32,23.5,-65.409582689335394,356.72741824002321,350.28207491772116,323.16703174099877,1030,"E",false,"nix"]
[{"$f":"IF(ASV_Daten!A101=\"\",\"\",ASV_Daten!A101)","v":"5d"},{"$f":"IF(ASV_Daten!B101=\"\",\"\",ASV_Daten!B101)","v":"Schulze"},{"$f":"IF(ASV_Daten!C101=\"\",\"\",ASV_Daten!C101)","v":"Anjoschka"},{"$f":"IF(ASV_Daten!D101=\"\",\"\",ASV_Daten!D101)","v":2011},{"$f":"IF(ASV_Daten!E101=\"\",\"\",ASV_Daten!E101)","v":"w"},"5dw",10,"10w",500,8.09,3.32,23.5,-65.409582689335394,356.72741824002321,350.28207491772116,323.16703174099877,1030,"E",false,"nix"]
[{"$f":"IF(ASV_Daten!A102=\"\",\"\",ASV_Daten!A102)","v":"5d"},{"$f":"IF(ASV_Daten!B102=\"\",\"\",ASV_Daten!B102)","v":"wlodomar"},{"$f":"IF(ASV_Daten!C102=\"\",\"\",ASV_Daten!C102)","v":"Hermann"},{"$f":"IF(ASV_Daten!D102=\"\",\"\",ASV_Daten!D102)","v":2011},{"$f":"IF(ASV_Daten!E102=\"\",\"\",ASV_Daten!E102)","v":"m"},"5dm",10,"10m",406,11.37,2.2200000000000002,12,50.842364532019737,74.874233856370665,155.10796464617991,60.372874103432238,290,"T",false,"nix"]
[{"$f":"IF(ASV_Daten!A103=\"\",\"\",ASV_Daten!A103)","v":"5d"},{"$f":"IF(ASV_Daten!B103=\"\",\"\",ASV_Daten!B103)","v":"Birkus"},{"$f":"IF(ASV_Daten!C103=\"\",\"\",ASV_Daten!C103)","v":"Yvo"},{"$f":"IF(ASV_Daten!D103=\"\",\"\",ASV_Daten!D103)","v":2011},{"$f":"IF(ASV_Daten!E103=\"\",\"\",ASV_Daten!E103)","v":"m"},"5dm",10,"10m",367,11.84,2.2999999999999998,11.5,94.465940054495888,50.590267780017214,167.2580314202329,53.742271960239478,315,"T",false,"nix"]
[{"$f":"IF(ASV_Daten!A104=\"\",\"\",ASV_Daten!A104)","v":"5d"},{"$f":"IF(ASV_Daten!B104=\"\",\"\",ASV_Daten!B104)","v":"Echems"},{"$f":"IF(ASV_Daten!C104=\"\",\"\",ASV_Daten!C104)","v":"Alexander"},{"$f":"IF(ASV_Daten!D104=\"\",\"\",ASV_Daten!D104)","v":2011},{"$f":"IF(ASV_Daten!E104=\"\",\"\",ASV_Daten!E104)","v":"m"},"5dm",10,"10m",400,10.97,2.82,18,57.000000000000014,97.145405887600333,241.55505131263311,131.14915337448045,470,"T",false,"nix"]
[{"$f":"IF(ASV_Daten!A105=\"\",\"\",ASV_Daten!A105)","v":"6a"},{"$f":"IF(ASV_Daten!B105=\"\",\"\",ASV_Daten!B105)","v":"Paustik"},{"$f":"IF(ASV_Daten!C105=\"\",\"\",ASV_Daten!C105)","v":"Tanja"},{"$f":"IF(ASV_Daten!D105=\"\",\"\",ASV_Daten!D105)","v":2009},{"$f":"IF(ASV_Daten!E105=\"\",\"\",ASV_Daten!E105)","v":"w"},"6aw",{"$f":"IF(D106=\"\",\"\",$B$1-$D106)","v":12},{"$f":"G106&E106","v":"12w"},319,10.28,2.72,15.5,{"$f":"IF(E106=\"w\",(((800/I106)-2.0232)/0.00647),(((1000/I106)-2.158)/0.006))","v":74.905253569646277},{"$f":"IF($E106=\"w\",(((50/(J106+0.24))-3.648)/0.0066),IF($E106=\"M\",(((50/(J106+0.24))-3.79)/0.0069),0))","v":167.4017743979721},{"$f":"IF($E106=\"w\",((SQRT(K106)-1.0935)/0.00208),IF($E106=\"m\",((SQRT(K106)-1.15028)/0.00219),0))","v":267.18377415724251},{"$f":"IF(E106=\"w\",((SQRT(L106)-2.0232)/0.00874),IF($E106=\"M\",((SQRT(L106)-2.8)/0.011),0))","v":218.97070217458872},654,"T",{"$f":"IF(AND(A106=\"1a\",E106=\"m\"),\"N1m\",IF(AND(A106=\"1a\",E106=\"w\"),\"N1w\",IF(AND(A106=\"1b\",E106=\"w\"),\"N1w\",IF(AND(A106=\"1b\",E106=\"m\"),\"N1m\",IF(AND(A106=\"2a\",E106=\"m\"),\"N2m\",IF(AND(A106=\"2a\",E106=\"w\"),\"N2w\",IF(AND(A106=\"2b\",E106=\"w\"),\"N2w\",IF(AND(A106=\"2b\",E106=\"m\"),\"N2m\",IF(AND(A106=\"3a\",E106=\"m\"),\"N3m\",IF(AND(A106=\"3a\",E106=\"w\"),\"N3w\",IF(AND(A106=\"3b\",E106=\"w\"),\"N3w\",IF(AND(A106=\"3b\",E106=\"m\"),\"N3m\",IF(AND(A106=\"4a\",E106=\"m\"),\"N4m\",IF(AND(A106=\"4a\",E106=\"w\"),\"N4w\",IF(AND(A106=\"4b\",E106=\"m\"),\"N4m\",IF(AND(A106=\"4b\",E106=\"w\"),\"N4w\"))))))))))))))))","v":false},"nix"]
[{"$f":"IF(ASV_Daten!A106=\"\",\"\",ASV_Daten!A106)","v":"6a"},{"$f":"IF(ASV_Daten!B106=\"\",\"\",ASV_Daten!B106)","v":"Struwe"},{"$f":"IF(ASV_Daten!C106=\"\",\"\",ASV_Daten!C106)","v":"Bert"},{"$f":"IF(ASV_Daten!D106=\"\",\"\",ASV_Daten!D106)","v":2009},{"$f":"IF(ASV_Daten!E106=\"\",\"\",ASV_Daten!E106)","v":"m"},"6am",12,"12m",500,8.85,2.1800000000000002,8.5,-26.333333333333318,247.90580507326089,148.95082466819181,10.497813402059142,407,"T",false,"nix"]
[{"$f":"IF(ASV_Daten!A107=\"\",\"\",ASV_Daten!A107)","v":"6a"},{"$f":"IF(ASV_Daten!B107=\"\",\"\",ASV_Daten!B107)","v":"Langwasser"},{"$f":"IF(ASV_Daten!C107=\"\",\"\",ASV_Daten!C107)","v":"Yvo"},{"$f":"IF(ASV_Daten!D107=\"\",\"\",ASV_Daten!D107)","v":2009},{"$f":"IF(ASV_Daten!E107=\"\",\"\",ASV_Daten!E107)","v":"m"},"6am",12,"12m",464,9.8699999999999992,2.94,19.5,-0.47126436781604514,167.47803150847918,257.69991778457745,146.89822119672039,572,"T",false,"nix"]
[{"$f":"IF(ASV_Daten!A108=\"\",\"\",ASV_Daten!A108)","v":"6a"},{"$f":"IF(ASV_Daten!B108=\"\",\"\",ASV_Daten!B108)","v":"Schöbel"},{"$f":"IF(ASV_Daten!C108=\"\",\"\",ASV_Daten!C108)","v":"Uwe"},{"$f":"IF(ASV_Daten!D108=\"\",\"\",ASV_Daten!D108)","v":2009},{"$f":"IF(ASV_Daten!E108=\"\",\"\",ASV_Daten!E108)","v":"m"},"6am",12,"12m",295,10.1,2.68,10.5,205.30508474576268,151.53477419897402,222.27879195182197,40.033668109448215,579,"T",false,"nix"]
[{"$f":"IF(ASV_Daten!A109=\"\",\"\",ASV_Daten!A109)","v":"6a"},{"$f":"IF(ASV_Daten!B109=\"\",\"\",ASV_Daten!B109)","v":"Schrüll"},{"$f":"IF(ASV_Daten!C109=\"\",\"\",ASV_Daten!C109)","v":"Sigbert"},{"$f":"IF(ASV_Daten!D109=\"\",\"\",ASV_Daten!D109)","v":2009},{"$f":"IF(ASV_Daten!E109=\"\",\"\",ASV_Daten!E109)","v":"m"},"6am",12,"12m",339,10.53,2.3199999999999998,16,131.97541789577187,123.55442520151257,170.26238409716052,109.09090909090911,426,"T",false,"nix"]
[{"$f":"IF(ASV_Daten!A110=\"\",\"\",ASV_Daten!A110)","v":"6a"},{"$f":"IF(ASV_Daten!B110=\"\",\"\",ASV_Daten!B110)","v":"Klim"},{"$f":"IF(ASV_Daten!C110=\"\",\"\",ASV_Daten!C110)","v":"Christian"},{"$f":"IF(ASV_Daten!D110=\"\",\"\",ASV_Daten!D110)","v":2009},{"$f":"IF(ASV_Daten!E110=\"\",\"\",ASV_Daten!E110)","v":"m"},"6am",12,"12m",319,10,3,19,162.79937304075236,158.37862318840578,265.648770579396,141.71808577642494,587,"T",false,"nix"]
[{"$f":"IF(ASV_Daten!A111=\"\",\"\",ASV_Daten!A111)","v":"6a"},{"$f":"IF(ASV_Daten!B111=\"\",\"\",ASV_Daten!B111)","v":"Schlup"},{"$f":"IF(ASV_Daten!C111=\"\",\"\",ASV_Daten!C111)","v":"Alexander"},{"$f":"IF(ASV_Daten!D111=\"\",\"\",ASV_Daten!D111)","v":2009},{"$f":"IF(ASV_Daten!E111=\"\",\"\",ASV_Daten!E111)","v":"m"},"6am",12,"12m",278,9.65,2.56,12.5,239.85371702637889,183.42198971292913,205.35159817351604,66.866718721157994,629,"T",false,"nix"]
[{"$f":"IF(ASV_Daten!A112=\"\",\"\",ASV_Daten!A112)","v":"6a"},{"$f":"IF(ASV_Daten!B112=\"\",\"\",ASV_Daten!B112)","v":"weber"},{"$f":"IF(ASV_Daten!C112=\"\",\"\",ASV_Daten!C112)","v":"Katharina"},{"$f":"IF(ASV_Daten!D112=\"\",\"\",ASV_Daten!D112)","v":2011},{"$f":"IF(ASV_Daten!E112=\"\",\"\",ASV_Daten!E112)","v":"w"},"6aw",10,"10w",282,10.19,2.86,22.5,125.76189066833284,173.61573549493016,287.33339063883483,311.23758469709031,772,"S",false,"nix"]
[{"$f":"IF(ASV_Daten!A113=\"\",\"\",ASV_Daten!A113)","v":"6a"},{"$f":"IF(ASV_Daten!B113=\"\",\"\",ASV_Daten!B113)","v":"Echems"},{"$f":"IF(ASV_Daten!C113=\"\",\"\",ASV_Daten!C113)","v":"Alexander"},{"$f":"IF(ASV_Daten!D113=\"\",\"\",ASV_Daten!D113)","v":2011},{"$f":"IF(ASV_Daten!E113=\"\",\"\",ASV_Daten!E113)","v":"m"},"6am",10,"10m",298,9.65,3.16,19.5,199.61744966442956,183.42198971292913,286.46524359046475,146.89822119672039,670,"S",false,"nix"]
[{"$f":"IF(ASV_Daten!A114=\"\",\"\",ASV_Daten!A114)","v":"6a"},{"$f":"IF(ASV_Daten!B114=\"\",\"\",ASV_Daten!B114)","v":"Paustik"},{"$f":"IF(ASV_Daten!C114=\"\",\"\",ASV_Daten!C114)","v":"Tanja"},{"$f":"IF(ASV_Daten!D114=\"\",\"\",ASV_Daten!D114)","v":2009},{"$f":"IF(ASV_Daten!E114=\"\",\"\",ASV_Daten!E114)","v":"w"},"6aw",12,"12w",439,9.5299999999999994,3.1,25.5,-31.047378297592203,222.6829192642908,320.76042604129862,346.28746786968406,890,"S",false,"nix"]
[{"$f":"IF(ASV_Daten!A115=\"\",\"\",ASV_Daten!A115)","v":"6a"},{"$f":"IF(ASV_Daten!B115=\"\",\"\",ASV_Daten!B115)","v":"Struwe"},{"$f":"IF(ASV_Daten!C115=\"\",\"\",ASV_Daten!C115)","v":"Bert"},{"$f":"IF(ASV_Daten!D115=\"\",\"\",ASV_Daten!D115)","v":2009},{"$f":"IF(ASV_Daten!E115=\"\",\"\",ASV_Daten!E115)","v":"m"},"6am",12,"12m",261,9.65,2.66,16.5,278.90293742017877,183.42198971292913,219.48431188584894,114.72901839254369,682,"T",false,"nix"]
[{"$f":"IF(ASV_Daten!A116=\"\",\"\",ASV_Daten!A116)","v":"6a"},{"$f":"IF(ASV_Daten!B116=\"\",\"\",ASV_Daten!B116)","v":"Langwasser"},{"$f":"IF(ASV_Daten!C116=\"\",\"\",ASV_Daten!C116)","v":"Yvo"},{"$f":"IF(ASV_Daten!D116=\"\",\"\",ASV_Daten!D116)","v":2009},{"$f":"IF(ASV_Daten!E116=\"\",\"\",ASV_Daten!E116)","v":"m"},"6am",12,"12m",312,11.3,2.65,24,174.52136752136755,78.660236606133651,218.08313224199568,190.81631686966873,583,"T",false,"nix"]
[{"$f":"IF(ASV_Daten!A117=\"\",\"\",ASV_Daten!A117)","v":"6a"},{"$f":"IF(ASV_Daten!B117=\"\",\"\",ASV_Daten!B117)","v":"Schöbel"},{"$f":"IF(ASV_Daten!C117=\"\",\"\",ASV_Daten!C117)","v":"Uwe"},{"$f":"IF(ASV_Daten!D117=\"\",\"\",ASV_Daten!D117)","v":2009},{"$f":"IF(ASV_Daten!E117=\"\",\"\",ASV_Daten!E117)","v":"m"},"6am",12,"12m",278,10.039999999999999,2.38,16,239.85371702637889,155.62510573507026,179.19856714801423,109.09090909090911,575,"T",false,"nix"]
[{"$f":"IF(ASV_Daten!A118=\"\",\"\",ASV_Daten!A118)","v":"6a"},{"$f":"IF(ASV_Daten!B118=\"\",\"\",ASV_Daten!B118)","v":"Schrüll"},{"$f":"IF(ASV_Daten!C118=\"\",\"\",ASV_Daten!C118)","v":"Sigbert"},{"$f":"IF(ASV_Daten!D118=\"\",\"\",ASV_Daten!D118)","v":2009},{"$f":"IF(ASV_Daten!E118=\"\",\"\",ASV_Daten!E118)","v":"m"},"6am",12,"12m",300,9.7200000000000006,2.96,17.5,195.88888888888891,178.27251033117969,260.35847187603895,125.75455751548891,635,"T",false,"nix"]
[{"$f":"IF(ASV_Daten!A119=\"\",\"\",ASV_Daten!A119)","v":"6a"},{"$f":"IF(ASV_Daten!B119=\"\",\"\",ASV_Daten!B119)","v":"Klim"},{"$f":"IF(ASV_Daten!C119=\"\",\"\",ASV_Daten!C119)","v":"Christian"},{"$f":"IF(ASV_Daten!D119=\"\",\"\",ASV_Daten!D119)","v":2009},{"$f":"IF(ASV_Daten!E119=\"\",\"\",ASV_Daten!E119)","v":"m"},"6am",12,"12m",319,9.44,3.07,13.5,162.79937304075236,199.31728350700686,274.82262410663157,79.475874015887953,637,"T",false,"nix"]
[{"$f":"IF(ASV_Daten!A120=\"\",\"\",ASV_Daten!A120)","v":"6a"},{"$f":"IF(ASV_Daten!B120=\"\",\"\",ASV_Daten!B120)","v":"Schlup"},{"$f":"IF(ASV_Daten!C120=\"\",\"\",ASV_Daten!C120)","v":"Alexander"},{"$f":"IF(ASV_Daten!D120=\"\",\"\",ASV_Daten!D120)","v":2009},{"$f":"IF(ASV_Daten!E120=\"\",\"\",ASV_Daten!E120)","v":"m"},"6am",12,"12m",259,9.06,2.06,16,283.83397683397681,229.90494000311668,130.13242440216095,109.09090909090911,644,"T",false,"nix"]
[{"$f":"IF(ASV_Daten!A121=\"\",\"\",ASV_Daten!A121)","v":"6a"},{"$f":"IF(ASV_Daten!B121=\"\",\"\",ASV_Daten!B121)","v":"weber"},{"$f":"IF(ASV_Daten!C121=\"\",\"\",ASV_Daten!C121)","v":"Katharina"},{"$f":"IF(ASV_Daten!D121=\"\",\"\",ASV_Daten!D121)","v":2011},{"$f":"IF(ASV_Daten!E121=\"\",\"\",ASV_Daten!E121)","v":"w"},"6aw",10,"10w",332,9.25,2.7,11.5,59.727751810953258,245.56119679407342,264.26330409398969,156.51773358840205,666,"S",false,"nix"]
[{"$f":"IF(ASV_Daten!A122=\"\",\"\",ASV_Daten!A122)","v":"6a"},{"$f":"IF(ASV_Daten!B122=\"\",\"\",ASV_Daten!B122)","v":"Echems"},{"$f":"IF(ASV_Daten!C122=\"\",\"\",ASV_Daten!C122)","v":"Alexander"},{"$f":"IF(ASV_Daten!D122=\"\",\"\",ASV_Daten!D122)","v":2011},{"$f":"IF(ASV_Daten!E122=\"\",\"\",ASV_Daten!E122)","v":"m"},"6am",10,"10m",332,9.34,2.9,11.5,142.34136546184743,207.13140298326829,252.35554182312327,53.742271960239478,602,"S",false,"nix"]
[{"$f":"IF(ASV_Daten!A123=\"\",\"\",ASV_Daten!A123)","v":"6a"},{"$f":"IF(ASV_Daten!B123=\"\",\"\",ASV_Daten!B123)","v":"Paustik"},{"$f":"IF(ASV_Daten!C123=\"\",\"\",ASV_Daten!C123)","v":"Tanja"},{"$f":"IF(ASV_Daten!D123=\"\",\"\",ASV_Daten!D123)","v":2009},{"$f":"IF(ASV_Daten!E123=\"\",\"\",ASV_Daten!E123)","v":"w"},"6aw",12,"12w",271,9.69,2.98,23,143.5594312666465,210.18889804388294,304.21521642461875,317.23472806781683,832,"S",false,"nix"]
[{"$f":"IF(ASV_Daten!A124=\"\",\"\",ASV_Daten!A124)","v":"6a"},{"$f":"IF(ASV_Daten!B124=\"\",\"\",ASV_Daten!B124)","v":"Struwe"},{"$f":"IF(ASV_Daten!C124=\"\",\"\",ASV_Daten!C124)","v":"Bert"},{"$f":"IF(ASV_Daten!D124=\"\",\"\",ASV_Daten!D124)","v":2009},{"$f":"IF(ASV_Daten!E124=\"\",\"\",ASV_Daten!E124)","v":"m"},"6am",12,"12m",312,8.94,2.7,14,174.52136752136755,240.0903034321619,225.06286416232805,85.605216979449239,640,"T",false,"nix"]
[{"$f":"IF(ASV_Daten!A125=\"\",\"\",ASV_Daten!A125)","v":"6a"},{"$f":"IF(ASV_Daten!B125=\"\",\"\",ASV_Daten!B125)","v":"Langwasser"},{"$f":"IF(ASV_Daten!C125=\"\",\"\",ASV_Daten!C125)","v":"Yvo"},{"$f":"IF(ASV_Daten!D125=\"\",\"\",ASV_Daten!D125)","v":2009},{"$f":"IF(ASV_Daten!E125=\"\",\"\",ASV_Daten!E125)","v":"m"},"6am",12,"12m",272,9.2799999999999994,3.12,21.5,253.07843137254901,211.89867251248324,281.31149464181249,166.98265888616839,746,"T",false,"nix"]
[{"$f":"IF(ASV_Daten!A126=\"\",\"\",ASV_Daten!A126)","v":"6a"},{"$f":"IF(ASV_Daten!B126=\"\",\"\",ASV_Daten!B126)","v":"Schöbel"},{"$f":"IF(ASV_Daten!C126=\"\",\"\",ASV_Daten!C126)","v":"Uwe"},{"$f":"IF(ASV_Daten!D126=\"\",\"\",ASV_Daten!D126)","v":2009},{"$f":"IF(ASV_Daten!E126=\"\",\"\",ASV_Daten!E126)","v":"m"},"6am",12,"12m",283,8.32,3.43,26.5,229.26148409893992,297.26398483001481,320.43192591105634,213.43773368122734,847,"S",false,"nix"]
[{"$f":"IF(ASV_Daten!A127=\"\",\"\",ASV_Daten!A127)","v":"6a"},{"$f":"IF(ASV_Daten!B127=\"\",\"\",ASV_Daten!B127)","v":"Schrüll"},{"$f":"IF(ASV_Daten!C127=\"\",\"\",ASV_Daten!C127)","v":"Sigbert"},{"$f":"IF(ASV_Daten!D127=\"\",\"\",ASV_Daten!D127)","v":2009},{"$f":"IF(ASV_Daten!E127=\"\",\"\",ASV_Daten!E127)","v":"m"},"6am",12,"12m",241,8.84,3.3,18.5,331.89626556016606,248.78375790078525,304.25123856552278,136.46933032011941,885,"S",false,"nix"]
[{"$f":"IF(ASV_Daten!A128=\"\",\"\",ASV_Daten!A128)","v":"6a"},{"$f":"IF(ASV_Daten!B128=\"\",\"\",ASV_Daten!B128)","v":"Klim"},{"$f":"IF(ASV_Daten!C128=\"\",\"\",ASV_Daten!C128)","v":"Christian"},{"$f":"IF(ASV_Daten!D128=\"\",\"\",ASV_Daten!D128)","v":2009},{"$f":"IF(ASV_Daten!E128=\"\",\"\",ASV_Daten!E128)","v":"m"},"6am",12,"12m",217,9.25,3.3,25,408.38248847926263,214.30491287549054,304.25123856552278,200.00000000000003,927,"S",false,"nix"]
[{"$f":"IF(ASV_Daten!A129=\"\",\"\",ASV_Daten!A129)","v":"6a"},{"$f":"IF(ASV_Daten!B129=\"\",\"\",ASV_Daten!B129)","v":"Schlup"},{"$f":"IF(ASV_Daten!C129=\"\",\"\",ASV_Daten!C129)","v":"Alexander"},{"$f":"IF(ASV_Daten!D129=\"\",\"\",ASV_Daten!D129)","v":2009},{"$f":"IF(ASV_Daten!E129=\"\",\"\",ASV_Daten!E129)","v":"m"},"6am",12,"12m",296,9.4700000000000006,3.16,29.5,203.39639639639643,197.00443290198356,286.46524359046475,239.21729505455528,729,"T",false,"nix"]
[{"$f":"IF(ASV_Daten!A130=\"\",\"\",ASV_Daten!A130)","v":"6a"},{"$f":"IF(ASV_Daten!B130=\"\",\"\",ASV_Daten!B130)","v":"weber"},{"$f":"IF(ASV_Daten!C130=\"\",\"\",ASV_Daten!C130)","v":"Katharina"},{"$f":"IF(ASV_Daten!D130=\"\",\"\",ASV_Daten!D130)","v":2011},{"$f":"IF(ASV_Daten!E130=\"\",\"\",ASV_Daten!E130)","v":"w"},"6aw",10,"10w",332,10.29,3,25.5,59.727751810953258,166.71789116233558,306.99558056196025,346.28746786968406,{"$f":"ROUND((SUM(M131:P131)-MIN(M131:P131)),0)","v":820},{"$f":"IF(H131=\"7w\",VLOOKUP(Q131,weiblich8,2),IF(H131=\"7m\",VLOOKUP(Q131,männlich8,2),IF(H131=\"8w\",VLOOKUP(Q131,weiblich8,2),IF(H131=\"8m\",VLOOKUP(Q131,männlich8,2),IF(H131=\"9w\",VLOOKUP(Q131,weiblich9,2),IF(H131=\"9m\",VLOOKUP(Q131,männlich9,2),IF(H131=\"10w\",VLOOKUP(Q131,weiblich10,2),IF(H131=\"10m\",VLOOKUP(Q131,männlich10,2),IF(H131=\"11w\",VLOOKUP(Q131,weiblich11,2),IF(H131=\"11m\",VLOOKUP(Q131,männlich11,2),IF(H131=\"12w\",VLOOKUP(Q131,weiblich12,2),IF(H131=\"12m\",VLOOKUP(Q131,männlich12,2),\"H\"))))))))))))","v":"S"},false,{"$f":"IF(S131=\"n1m\",VLOOKUP(Q131,N1m,2),IF(S131=\"N1w\",VLOOKUP(Q131,N1w,2),IF(S131=\"N2m\",VLOOKUP(Q131,n2m,2),IF(S131=\"N2w\",VLOOKUP(Q131,n2w,2),IF(S131=\"N3w\",VLOOKUP(Q131,n3w,2),IF(S131=\"N3m\",VLOOKUP(Q131,n3m,2),IF(S131=\"N4w\",VLOOKUP(Q131,n4w,2),IF(S131=\"N4m\",VLOOKUP(Q131,n4m,2),\"nix\"))))))))","v":"nix"}]
[{"$f":"IF(ASV_Daten!A131=\"\",\"\",ASV_Daten!A131)","v":"6b"},{"$f":"IF(ASV_Daten!B131=\"\",\"\",ASV_Daten!B131)","v":"Becker              "},{"$f":"IF(ASV_Daten!C131=\"\",\"\",ASV_Daten!C131)","v":"Jonas"},{"$f":"IF(ASV_Daten!D131=\"\",\"\",ASV_Daten!D131)","v":2010},{"$f":"IF(ASV_Daten!E131=\"\",\"\",ASV_Daten!E131)","v":"m"},"6bm",11,"11m",275,10.41,3.24,21,246.39393939393938,131.13560590596722,296.67579908675799,162.05233590507638,705,"S",false,"nix"]
[{"$f":"IF(ASV_Daten!A132=\"\",\"\",ASV_Daten!A132)","v":"6b"},{"$f":"IF(ASV_Daten!B132=\"\",\"\",ASV_Daten!B132)","v":"Becker              "},{"$f":"IF(ASV_Daten!C132=\"\",\"\",ASV_Daten!C132)","v":"Jutta"},{"$f":"IF(ASV_Daten!D132=\"\",\"\",ASV_Daten!D132)","v":2010},{"$f":"IF(ASV_Daten!E132=\"\",\"\",ASV_Daten!E132)","v":"w"},{"$f":"A133&E133","v":"6bw"},11,"11w",341,8.3800000000000008,3.22,16,49.898153897755037,326.13091471560142,336.98838677530586,226.17848970251717,889,"S",false,"nix"]
[{"$f":"IF(ASV_Daten!A133=\"\",\"\",ASV_Daten!A133)","v":"6b"},{"$f":"IF(ASV_Daten!B133=\"\",\"\",ASV_Daten!B133)","v":"Gerlach             "},{"$f":"IF(ASV_Daten!C133=\"\",\"\",ASV_Daten!C133)","v":"Peter"},{"$f":"IF(ASV_Daten!D133=\"\",\"\",ASV_Daten!D133)","v":2010},{"$f":"IF(ASV_Daten!E133=\"\",\"\",ASV_Daten!E133)","v":"m"},"6bm",11,"11m",319,8.69,3.22,20.5,162.79937304075236,262.18900628073425,294.13508880942283,157.06296082442807,719,"S",false,"nix"]
[{"$f":"IF(ASV_Daten!A134=\"\",\"\",ASV_Daten!A134)","v":"6b"},{"$f":"IF(ASV_Daten!B134=\"\",\"\",ASV_Daten!B134)","v":"Herold              "},{"$f":"IF(ASV_Daten!C134=\"\",\"\",ASV_Daten!C134)","v":"Karin"},{"$f":"IF(ASV_Daten!D134=\"\",\"\",ASV_Daten!D134)","v":2010},{"$f":"IF(ASV_Daten!E134=\"\",\"\",ASV_Daten!E134)","v":"w"},"6bw",11,"11w",285,9.44,3.32,21.5,121.14645191030121,229.89231154520414,350.28207491772116,299.03995969655057,879,"S",false,"nix"]
[{"$f":"IF(ASV_Daten!A135=\"\",\"\",ASV_Daten!A135)","v":"6b"},{"$f":"IF(ASV_Daten!B135=\"\",\"\",ASV_Daten!B135)","v":"Herbst              "},{"$f":"IF(ASV_Daten!C135=\"\",\"\",ASV_Daten!C135)","v":"Sandra"},{"$f":"IF(ASV_Daten!D135=\"\",\"\",ASV_Daten!D135)","v":2009},{"$f":"IF(ASV_Daten!E135=\"\",\"\",ASV_Daten!E135)","v":"w"},"6bw",12,"12w",237,9.2799999999999994,3,14.5,209.01505813915571,243.04558186911126,306.99558056196025,204.19754610205428,759,"T",false,"nix"]
[{"$f":"IF(ASV_Daten!A136=\"\",\"\",ASV_Daten!A136)","v":"6b"},{"$f":"IF(ASV_Daten!B136=\"\",\"\",ASV_Daten!B136)","v":"König               "},{"$f":"IF(ASV_Daten!C136=\"\",\"\",ASV_Daten!C136)","v":"Gabriele"},{"$f":"IF(ASV_Daten!D136=\"\",\"\",ASV_Daten!D136)","v":2009},{"$f":"IF(ASV_Daten!E136=\"\",\"\",ASV_Daten!E136)","v":"w"},"6bw",12,"12w",275,9.91,2.76,24.5,136.92286075593648,193.65278399761161,272.99267912673798,334.84524808991222,801,"S",false,"nix"]
[{"$f":"IF(ASV_Daten!A137=\"\",\"\",ASV_Daten!A137)","v":"6b"},{"$f":"IF(ASV_Daten!B137=\"\",\"\",ASV_Daten!B137)","v":"Löwe                "},{"$f":"IF(ASV_Daten!C137=\"\",\"\",ASV_Daten!C137)","v":"Jutta"},{"$f":"IF(ASV_Daten!D137=\"\",\"\",ASV_Daten!D137)","v":2009},{"$f":"IF(ASV_Daten!E137=\"\",\"\",ASV_Daten!E137)","v":"w"},"6bw",12,{"$f":"G138&E138","v":"12w"},256,9.69,2.9,21.5,170.29366306027819,210.18889804388294,292.99934451569237,299.03995969655057,802,"S",false,"nix"]
[{"$f":"IF(ASV_Daten!A138=\"\",\"\",ASV_Daten!A138)","v":"6b"},{"$f":"IF(ASV_Daten!B138=\"\",\"\",ASV_Daten!B138)","v":"Lachner             "},{"$f":"IF(ASV_Daten!C138=\"\",\"\",ASV_Daten!C138)","v":"Thomas"},{"$f":"IF(ASV_Daten!D138=\"\",\"\",ASV_Daten!D138)","v":2009},{"$f":"IF(ASV_Daten!E138=\"\",\"\",ASV_Daten!E138)","v":"m"},"6bm",12,"12m",457,10.56,2.82,20.5,5.030634573304142,121.68545356951155,241.55505131263311,157.06296082442807,520,"T",false,"nix"]
[{"$f":"IF(ASV_Daten!A139=\"\",\"\",ASV_Daten!A139)","v":"6b"},{"$f":"IF(ASV_Daten!B139=\"\",\"\",ASV_Daten!B139)","v":"Becker              "},{"$f":"IF(ASV_Daten!C139=\"\",\"\",ASV_Daten!C139)","v":"Jonas"},{"$f":"IF(ASV_Daten!D139=\"\",\"\",ASV_Daten!D139)","v":2010},{"$f":"IF(ASV_Daten!E139=\"\",\"\",ASV_Daten!E139)","v":"m"},"6bm",11,"11m",439,9.7799999999999994,2.9,25.5,19.984054669703877,173.91593624345518,252.35554182312327,204.52295174373083,631,"T",false,"nix"]
[{"$f":"IF(ASV_Daten!A140=\"\",\"\",ASV_Daten!A140)","v":"6b"},{"$f":"IF(ASV_Daten!B140=\"\",\"\",ASV_Daten!B140)","v":"Becker              "},{"$f":"IF(ASV_Daten!C140=\"\",\"\",ASV_Daten!C140)","v":"Jutta"},{"$f":"IF(ASV_Daten!D140=\"\",\"\",ASV_Daten!D140)","v":2010},{"$f":"IF(ASV_Daten!E140=\"\",\"\",ASV_Daten!E140)","v":"w"},"6bw",11,"11w",314,9.7200000000000006,2.9,25,81.077388042804088,207.89095777047572,292.99934451569237,340.59496567505721,841,"S",false,"nix"]
[{"$f":"IF(ASV_Daten!A141=\"\",\"\",ASV_Daten!A141)","v":"6b"},{"$f":"IF(ASV_Daten!B141=\"\",\"\",ASV_Daten!B141)","v":"Gerlach             "},{"$f":"IF(ASV_Daten!C141=\"\",\"\",ASV_Daten!C141)","v":"Peter"},{"$f":"IF(ASV_Daten!D141=\"\",\"\",ASV_Daten!D141)","v":2010},{"$f":"IF(ASV_Daten!E141=\"\",\"\",ASV_Daten!E141)","v":"m"},"6bm",11,"11m",244,9.3800000000000008,2.96,15.5,323.39344262295077,203.9862605079995,260.35847187603895,103.36399427326417,788,"S",false,"nix"]
[{"$f":"IF(ASV_Daten!A142=\"\",\"\",ASV_Daten!A142)","v":"6b"},{"$f":"IF(ASV_Daten!B142=\"\",\"\",ASV_Daten!B142)","v":"Herold              "},{"$f":"IF(ASV_Daten!C142=\"\",\"\",ASV_Daten!C142)","v":"Karin"},{"$f":"IF(ASV_Daten!D142=\"\",\"\",ASV_Daten!D142)","v":2010},{"$f":"IF(ASV_Daten!E142=\"\",\"\",ASV_Daten!E142)","v":"w"},{"$f":"A143&E143","v":"6bw"},{"$f":"IF(D143=\"\",\"\",$B$1-$D143)","v":11},{"$f":"G143&E143","v":"11w"},null,null,null,null,null,null,null,null,null,null,{"$f":"IF(AND(A143=\"1a\",E143=\"m\"),\"N1m\",IF(AND(A143=\"1a\",E143=\"w\"),\"N1w\",IF(AND(A143=\"1b\",E143=\"w\"),\"N1w\",IF(AND(A143=\"1b\",E143=\"m\"),\"N1m\",IF(AND(A143=\"2a\",E143=\"m\"),\"N2m\",IF(AND(A143=\"2a\",E143=\"w\"),\"N2w\",IF(AND(A143=\"2b\",E143=\"w\"),\"N2w\",IF(AND(A143=\"2b\",E143=\"m\"),\"N2m\",IF(AND(A143=\"3a\",E143=\"m\"),\"N3m\",IF(AND(A143=\"3a\",E143=\"w\"),\"N3w\",IF(AND(A143=\"3b\",E143=\"w\"),\"N3w\",IF(AND(A143=\"3b\",E143=\"m\"),\"N3m\",IF(AND(A143=\"4a\",E143=\"m\"),\"N4m\",IF(AND(A143=\"4a\",E143=\"w\"),\"N4w\",IF(AND(A143=\"4b\",E143=\"m\"),\"N4m\",IF(AND(A143=\"4b\",E143=\"w\"),\"N4w\"))))))))))))))))","v":false},{"$f":"IF(S143=\"n1m\",VLOOKUP(Q143,N1m,2),IF(S143=\"N1w\",VLOOKUP(Q143,N1w,2),IF(S143=\"N2m\",VLOOKUP(Q143,n2m,2),IF(S143=\"N2w\",VLOOKUP(Q143,n2w,2),IF(S143=\"N3w\",VLOOKUP(Q143,n3w,2),IF(S143=\"N3m\",VLOOKUP(Q143,n3m,2),IF(S143=\"N4w\",VLOOKUP(Q143,n4w,2),IF(S143=\"N4m\",VLOOKUP(Q143,n4m,2),\"nix\"))))))))","v":"nix"}]
[{"$f":"IF(ASV_Daten!A143=\"\",\"\",ASV_Daten!A143)","v":"6b"},{"$f":"IF(ASV_Daten!B143=\"\",\"\",ASV_Daten!B143)","v":"Herbst              "},{"$f":"IF(ASV_Daten!C143=\"\",\"\",ASV_Daten!C143)","v":"Sandra"},{"$f":"IF(ASV_Daten!D143=\"\",\"\",ASV_Daten!D143)","v":2009},{"$f":"IF(ASV_Daten!E143=\"\",\"\",ASV_Daten!E143)","v":"w"},"6bw",12,"12w",null,null,null,null,null,null,null,null,null,null,false,"nix"]
[{"$f":"IF(ASV_Daten!A144=\"\",\"\",ASV_Daten!A144)","v":"6b"},{"$f":"IF(ASV_Daten!B144=\"\",\"\",ASV_Daten!B144)","v":"König               "},{"$f":"IF(ASV_Daten!C144=\"\",\"\",ASV_Daten!C144)","v":"Gabriele"},{"$f":"IF(ASV_Daten!D144=\"\",\"\",ASV_Daten!D144)","v":2009},{"$f":"IF(ASV_Daten!E144=\"\",\"\",ASV_Daten!E144)","v":"w"},"6bw",12,"12w",null,null,null,null,null,null,null,null,null,null,false,"nix"]
[{"$f":"IF(ASV_Daten!A145=\"\",\"\",ASV_Daten!A145)","v":"6b"},{"$f":"IF(ASV_Daten!B145=\"\",\"\",ASV_Daten!B145)","v":"Löwe                "},{"$f":"IF(ASV_Daten!C145=\"\",\"\",ASV_Daten!C145)","v":"Jutta"},{"$f":"IF(ASV_Daten!D145=\"\",\"\",ASV_Daten!D145)","v":2009},{"$f":"IF(ASV_Daten!E145=\"\",\"\",ASV_Daten!E145)","v":"w"},"6bw",12,"12w",null,null,null,null,null,null,null,null,null,null,false,"nix"]
[{"$f":"IF(ASV_Daten!A146=\"\",\"\",ASV_Daten!A146)","v":"6b"},{"$f":"IF(ASV_Daten!B146=\"\",\"\",ASV_Daten!B146)","v":"Lachner             "},{"$f":"IF(ASV_Daten!C146=\"\",\"\",ASV_Daten!C146)","v":"Thomas"},{"$f":"IF(ASV_Daten!D146=\"\",\"\",ASV_Daten!D146)","v":2009},{"$f":"IF(ASV_Daten!E146=\"\",\"\",ASV_Daten!E146)","v":"m"},"6bm",12,"12m",null,null,null,null,null,null,null,null,null,null,false,"nix"]
[{"$f":"IF(ASV_Daten!A147=\"\",\"\",ASV_Daten!A147)","v":"6b"},{"$f":"IF(ASV_Daten!B147=\"\",\"\",ASV_Daten!B147)","v":"Becker              "},{"$f":"IF(ASV_Daten!C147=\"\",\"\",ASV_Daten!C147)","v":"Jonas"},{"$f":"IF(ASV_Daten!D147=\"\",\"\",ASV_Daten!D147)","v":2010},{"$f":"IF(ASV_Daten!E147=\"\",\"\",ASV_Daten!E147)","v":"m"},"6bm",11,"11m",null,null,null,null,null,null,null,null,null,null,false,"nix"]
[{"$f":"IF(ASV_Daten!A148=\"\",\"\",ASV_Daten!A148)","v":"6b"},{"$f":"IF(ASV_Daten!B148=\"\",\"\",ASV_Daten!B148)","v":"Becker              "},{"$f":"IF(ASV_Daten!C148=\"\",\"\",ASV_Daten!C148)","v":"Jutta"},{"$f":"IF(ASV_Daten!D148=\"\",\"\",ASV_Daten!D148)","v":2010},{"$f":"IF(ASV_Daten!E148=\"\",\"\",ASV_Daten!E148)","v":"w"},"6bw",11,"11w",null,null,null,null,null,null,null,null,null,null,{"$f":"IF(AND(A149=\"1a\",E149=\"m\"),\"N1m\",IF(AND(A149=\"1a\",E149=\"w\"),\"N1w\",IF(AND(A149=\"1b\",E149=\"w\"),\"N1w\",IF(AND(A149=\"1b\",E149=\"m\"),\"N1m\",IF(AND(A149=\"2a\",E149=\"m\"),\"N2m\",IF(AND(A149=\"2a\",E149=\"w\"),\"N2w\",IF(AND(A149=\"2b\",E149=\"w\"),\"N2w\",IF(AND(A149=\"2b\",E149=\"m\"),\"N2m\",IF(AND(A149=\"3a\",E149=\"m\"),\"N3m\",IF(AND(A149=\"3a\",E149=\"w\"),\"N3w\",IF(AND(A149=\"3b\",E149=\"w\"),\"N3w\",IF(AND(A149=\"3b\",E149=\"m\"),\"N3m\",IF(AND(A149=\"4a\",E149=\"m\"),\"N4m\",IF(AND(A149=\"4a\",E149=\"w\"),\"N4w\",IF(AND(A149=\"4b\",E149=\"m\"),\"N4m\",IF(AND(A149=\"4b\",E149=\"w\"),\"N4w\"))))))))))))))))","v":false},{"$f":"IF(S149=\"n1m\",VLOOKUP(Q149,N1m,2),IF(S149=\"N1w\",VLOOKUP(Q149,N1w,2),IF(S149=\"N2m\",VLOOKUP(Q149,n2m,2),IF(S149=\"N2w\",VLOOKUP(Q149,n2w,2),IF(S149=\"N3w\",VLOOKUP(Q149,n3w,2),IF(S149=\"N3m\",VLOOKUP(Q149,n3m,2),IF(S149=\"N4w\",VLOOKUP(Q149,n4w,2),IF(S149=\"N4m\",VLOOKUP(Q149,n4m,2),\"nix\"))))))))","v":"nix"}]
[{"$f":"IF(ASV_Daten!A149=\"\",\"\",ASV_Daten!A149)","v":"6b"},{"$f":"IF(ASV_Daten!B149=\"\",\"\",ASV_Daten!B149)","v":"Gerlach             "},{"$f":"IF(ASV_Daten!C149=\"\",\"\",ASV_Daten!C149)","v":"Peter"},{"$f":"IF(ASV_Daten!D149=\"\",\"\",ASV_Daten!D149)","v":2010},{"$f":"IF(ASV_Daten!E149=\"\",\"\",ASV_Daten!E149)","v":"m"},"6bm",11,"11m",null,null,null,null,null,null,null,null,null,null,false,"nix"]
[{"$f":"IF(ASV_Daten!A150=\"\",\"\",ASV_Daten!A150)","v":"6b"},{"$f":"IF(ASV_Daten!B150=\"\",\"\",ASV_Daten!B150)","v":"Herold              "},{"$f":"IF(ASV_Daten!C150=\"\",\"\",ASV_Daten!C150)","v":"Karin"},{"$f":"IF(ASV_Daten!D150=\"\",\"\",ASV_Daten!D150)","v":2010},{"$f":"IF(ASV_Daten!E150=\"\",\"\",ASV_Daten!E150)","v":"w"},"6bw",11,"11w",null,null,null,null,null,null,null,null,null,null,false,"nix"]
[{"$f":"IF(ASV_Daten!A151=\"\",\"\",ASV_Daten!A151)","v":"6b"},{"$f":"IF(ASV_Daten!B151=\"\",\"\",ASV_Daten!B151)","v":"Herbst              "},{"$f":"IF(ASV_Daten!C151=\"\",\"\",ASV_Daten!C151)","v":"Sandra"},{"$f":"IF(ASV_Daten!D151=\"\",\"\",ASV_Daten!D151)","v":2009},{"$f":"IF(ASV_Daten!E151=\"\",\"\",ASV_Daten!E151)","v":"w"},{"$f":"A152&E152","v":"6bw"},{"$f":"IF(D152=\"\",\"\",$B$1-$D152)","v":12},{"$f":"G152&E152","v":"12w"},null,null,null,null,null,null,null,null,null,null,false,"nix"]
[{"$f":"IF(ASV_Daten!A152=\"\",\"\",ASV_Daten!A152)","v":"6b"},{"$f":"IF(ASV_Daten!B152=\"\",\"\",ASV_Daten!B152)","v":"König               "},{"$f":"IF(ASV_Daten!C152=\"\",\"\",ASV_Daten!C152)","v":"Gabriele"},{"$f":"IF(ASV_Daten!D152=\"\",\"\",ASV_Daten!D152)","v":2009},{"$f":"IF(ASV_Daten!E152=\"\",\"\",ASV_Daten!E152)","v":"w"},"6bw",12,"12w",null,null,null,null,null,null,null,null,null,null,false,"nix"]
[{"$f":"IF(ASV_Daten!A153=\"\",\"\",ASV_Daten!A153)","v":"6b"},{"$f":"IF(ASV_Daten!B153=\"\",\"\",ASV_Daten!B153)","v":"Löwe                "},{"$f":"IF(ASV_Daten!C153=\"\",\"\",ASV_Daten!C153)","v":"Jutta"},{"$f":"IF(ASV_Daten!D153=\"\",\"\",ASV_Daten!D153)","v":2009},{"$f":"IF(ASV_Daten!E153=\"\",\"\",ASV_Daten!E153)","v":"w"},"6bw",12,"12w",null,null,null,null,null,null,null,null,null,null,false,"nix"]
[{"$f":"IF(ASV_Daten!A154=\"\",\"\",ASV_Daten!A154)","v":"6b"},{"$f":"IF(ASV_Daten!B154=\"\",\"\",ASV_Daten!B154)","v":"Lachner             "},{"$f":"IF(ASV_Daten!C154=\"\",\"\",ASV_Daten!C154)","v":"Thomas"},{"$f":"IF(ASV_Daten!D154=\"\",\"\",ASV_Daten!D154)","v":2009},{"$f":"IF(ASV_Daten!E154=\"\",\"\",ASV_Daten!E154)","v":"m"},"6bm",12,"12m",null,null,null,null,null,null,null,null,null,null,false,"nix"]
[{"$f":"IF(ASV_Daten!A155=\"\",\"\",ASV_Daten!A155)","v":"6c"},{"$f":"IF(ASV_Daten!B155=\"\",\"\",ASV_Daten!B155)","v":"Bäter"},{"$f":"IF(ASV_Daten!C155=\"\",\"\",ASV_Daten!C155)","v":"Stella"},{"$f":"IF(ASV_Daten!D155=\"\",\"\",ASV_Daten!D155)","v":2011},{"$f":"IF(ASV_Daten!E155=\"\",\"\",ASV_Daten!E155)","v":"w"},"6cw",10,"10w",null,null,null,null,null,null,null,null,null,null,false,"nix"]
[{"$f":"IF(ASV_Daten!A156=\"\",\"\",ASV_Daten!A156)","v":"6c"},{"$f":"IF(ASV_Daten!B156=\"\",\"\",ASV_Daten!B156)","v":"Brüssing"},{"$f":"IF(ASV_Daten!C156=\"\",\"\",ASV_Daten!C156)","v":"Philipp"},{"$f":"IF(ASV_Daten!D156=\"\",\"\",ASV_Daten!D156)","v":2011},{"$f":"IF(ASV_Daten!E156=\"\",\"\",ASV_Daten!E156)","v":"m"},"6cm",10,"10m",null,null,null,null,null,null,null,null,null,null,false,"nix"]
[{"$f":"IF(ASV_Daten!A157=\"\",\"\",ASV_Daten!A157)","v":"6c"},{"$f":"IF(ASV_Daten!B157=\"\",\"\",ASV_Daten!B157)","v":"Rollas"},{"$f":"IF(ASV_Daten!C157=\"\",\"\",ASV_Daten!C157)","v":"Gerd"},{"$f":"IF(ASV_Daten!D157=\"\",\"\",ASV_Daten!D157)","v":2011},{"$f":"IF(ASV_Daten!E157=\"\",\"\",ASV_Daten!E157)","v":"m"},"6cm",10,"10m",null,null,null,null,null,null,null,null,null,null,false,"nix"]
[{"$f":"IF(ASV_Daten!A158=\"\",\"\",ASV_Daten!A158)","v":"6c"},{"$f":"IF(ASV_Daten!B158=\"\",\"\",ASV_Daten!B158)","v":"Gerlach"},{"$f":"IF(ASV_Daten!C158=\"\",\"\",ASV_Daten!C158)","v":"Siegfried"},{"$f":"IF(ASV_Daten!D158=\"\",\"\",ASV_Daten!D158)","v":2011},{"$f":"IF(ASV_Daten!E158=\"\",\"\",ASV_Daten!E158)","v":"m"},"6cm",10,"10m",null,null,null,null,null,null,null,null,null,null,false,"nix"]
[{"$f":"IF(ASV_Daten!A159=\"\",\"\",ASV_Daten!A159)","v":"6c"},{"$f":"IF(ASV_Daten!B159=\"\",\"\",ASV_Daten!B159)","v":"Althaus             "},{"$f":"IF(ASV_Daten!C159=\"\",\"\",ASV_Daten!C159)","v":"Christa"},{"$f":"IF(ASV_Daten!D159=\"\",\"\",ASV_Daten!D159)","v":2009},{"$f":"IF(ASV_Daten!E159=\"\",\"\",ASV_Daten!E159)","v":"w"},"6cw",12,"12w",null,null,null,null,null,null,null,null,null,null,false,"nix"]
[{"$f":"IF(ASV_Daten!A160=\"\",\"\",ASV_Daten!A160)","v":"6c"},{"$f":"IF(ASV_Daten!B160=\"\",\"\",ASV_Daten!B160)","v":"Alt                 "},{"$f":"IF(ASV_Daten!C160=\"\",\"\",ASV_Daten!C160)","v":"Julia"},{"$f":"IF(ASV_Daten!D160=\"\",\"\",ASV_Daten!D160)","v":2009},{"$f":"IF(ASV_Daten!E160=\"\",\"\",ASV_Daten!E160)","v":"w"},"6cw",12,"12w",null,null,null,null,null,null,null,null,null,null,false,"nix"]
[{"$f":"IF(ASV_Daten!A161=\"\",\"\",ASV_Daten!A161)","v":"6c"},{"$f":"IF(ASV_Daten!B161=\"\",\"\",ASV_Daten!B161)","v":"Andersen            "},{"$f":"IF(ASV_Daten!C161=\"\",\"\",ASV_Daten!C161)","v":"Thomas"},{"$f":"IF(ASV_Daten!D161=\"\",\"\",ASV_Daten!D161)","v":2009},{"$f":"IF(ASV_Daten!E161=\"\",\"\",ASV_Daten!E161)","v":"m"},"6cm",12,"12m",null,null,null,null,null,null,null,null,null,null,false,"nix"]
[{"$f":"IF(ASV_Daten!A162=\"\",\"\",ASV_Daten!A162)","v":"6c"},{"$f":"IF(ASV_Daten!B162=\"\",\"\",ASV_Daten!B162)","v":"Becker              "},{"$f":"IF(ASV_Daten!C162=\"\",\"\",ASV_Daten!C162)","v":"Carola"},{"$f":"IF(ASV_Daten!D162=\"\",\"\",ASV_Daten!D162)","v":2009},{"$f":"IF(ASV_Daten!E162=\"\",\"\",ASV_Daten!E162)","v":"w"},"6cw",12,"12w",null,null,null,null,null,null,null,null,null,null,false,"nix"]
[{"$f":"IF(ASV_Daten!A163=\"\",\"\",ASV_Daten!A163)","v":"6c"},{"$f":"IF(ASV_Daten!B163=\"\",\"\",ASV_Daten!B163)","v":"Beck                "},{"$f":"IF(ASV_Daten!C163=\"\",\"\",ASV_Daten!C163)","v":"Franz"},{"$f":"IF(ASV_Daten!D163=\"\",\"\",ASV_Daten!D163)","v":2009},{"$f":"IF(ASV_Daten!E163=\"\",\"\",ASV_Daten!E163)","v":"m"},"6cm",12,"12m",null,null,null,null,null,null,null,null,null,null,false,"nix"]
[{"$f":"IF(ASV_Daten!A164=\"\",\"\",ASV_Daten!A164)","v":"6c"},{"$f":"IF(ASV_Daten!B164=\"\",\"\",ASV_Daten!B164)","v":"Bäter"},{"$f":"IF(ASV_Daten!C164=\"\",\"\",ASV_Daten!C164)","v":"Stella"},{"$f":"IF(ASV_Daten!D164=\"\",\"\",ASV_Daten!D164)","v":2011},{"$f":"IF(ASV_Daten!E164=\"\",\"\",ASV_Daten!E164)","v":"w"},"6cw",10,"10w",null,null,null,null,null,null,null,null,null,null,false,"nix"]
[{"$f":"IF(ASV_Daten!A165=\"\",\"\",ASV_Daten!A165)","v":"6c"},{"$f":"IF(ASV_Daten!B165=\"\",\"\",ASV_Daten!B165)","v":"Brüssing"},{"$f":"IF(ASV_Daten!C165=\"\",\"\",ASV_Daten!C165)","v":"Philipp"},{"$f":"IF(ASV_Daten!D165=\"\",\"\",ASV_Daten!D165)","v":2011},{"$f":"IF(ASV_Daten!E165=\"\",\"\",ASV_Daten!E165)","v":"m"},"6cm",10,"10m",null,null,null,null,null,null,null,null,null,null,false,"nix"]
[{"$f":"IF(ASV_Daten!A166=\"\",\"\",ASV_Daten!A166)","v":"6c"},{"$f":"IF(ASV_Daten!B166=\"\",\"\",ASV_Daten!B166)","v":"Rollas"},{"$f":"IF(ASV_Daten!C166=\"\",\"\",ASV_Daten!C166)","v":"Gerd"},{"$f":"IF(ASV_Daten!D166=\"\",\"\",ASV_Daten!D166)","v":2011},{"$f":"IF(ASV_Daten!E166=\"\",\"\",ASV_Daten!E166)","v":"m"},"6cm",10,"10m",null,null,null,null,null,null,null,null,null,null,false,"nix"]
[{"$f":"IF(ASV_Daten!A167=\"\",\"\",ASV_Daten!A167)","v":"6c"},{"$f":"IF(ASV_Daten!B167=\"\",\"\",ASV_Daten!B167)","v":"Gerlach"},{"$f":"IF(ASV_Daten!C167=\"\",\"\",ASV_Daten!C167)","v":"Siegfried"},{"$f":"IF(ASV_Daten!D167=\"\",\"\",ASV_Daten!D167)","v":2011},{"$f":"IF(ASV_Daten!E167=\"\",\"\",ASV_Daten!E167)","v":"m"},"6cm",10,"10m",null,null,null,null,null,null,null,null,null,null,false,"nix"]
[{"$f":"IF(ASV_Daten!A168=\"\",\"\",ASV_Daten!A168)","v":"6c"},{"$f":"IF(ASV_Daten!B168=\"\",\"\",ASV_Daten!B168)","v":"Althaus             "},{"$f":"IF(ASV_Daten!C168=\"\",\"\",ASV_Daten!C168)","v":"Christa"},{"$f":"IF(ASV_Daten!D168=\"\",\"\",ASV_Daten!D168)","v":2009},{"$f":"IF(ASV_Daten!E168=\"\",\"\",ASV_Daten!E168)","v":"w"},"6cw",12,"12w",null,null,null,null,null,null,null,null,null,null,false,"nix"]
[{"$f":"IF(ASV_Daten!A169=\"\",\"\",ASV_Daten!A169)","v":"6c"},{"$f":"IF(ASV_Daten!B169=\"\",\"\",ASV_Daten!B169)","v":"Alt                 "},{"$f":"IF(ASV_Daten!C169=\"\",\"\",ASV_Daten!C169)","v":"Julia"},{"$f":"IF(ASV_Daten!D169=\"\",\"\",ASV_Daten!D169)","v":2009},{"$f":"IF(ASV_Daten!E169=\"\",\"\",ASV_Daten!E169)","v":"w"},"6cw",12,"12w",null,null,null,null,null,null,null,null,null,null,false,"nix"]
[{"$f":"IF(ASV_Daten!A170=\"\",\"\",ASV_Daten!A170)","v":"6c"},{"$f":"IF(ASV_Daten!B170=\"\",\"\",ASV_Daten!B170)","v":"Andersen            "},{"$f":"IF(ASV_Daten!C170=\"\",\"\",ASV_Daten!C170)","v":"Thomas"},{"$f":"IF(ASV_Daten!D170=\"\",\"\",ASV_Daten!D170)","v":2009},{"$f":"IF(ASV_Daten!E170=\"\",\"\",ASV_Daten!E170)","v":"m"},"6cm",12,"12m",null,null,null,null,null,null,null,null,null,null,false,"nix"]
[{"$f":"IF(ASV_Daten!A171=\"\",\"\",ASV_Daten!A171)","v":"6c"},{"$f":"IF(ASV_Daten!B171=\"\",\"\",ASV_Daten!B171)","v":"Becker              "},{"$f":"IF(ASV_Daten!C171=\"\",\"\",ASV_Daten!C171)","v":"Carola"},{"$f":"IF(ASV_Daten!D171=\"\",\"\",ASV_Daten!D171)","v":2009},{"$f":"IF(ASV_Daten!E171=\"\",\"\",ASV_Daten!E171)","v":"w"},"6cw",12,"12w",null,null,null,null,null,null,null,null,null,null,false,"nix"]
[{"$f":"IF(ASV_Daten!A172=\"\",\"\",ASV_Daten!A172)","v":"6c"},{"$f":"IF(ASV_Daten!B172=\"\",\"\",ASV_Daten!B172)","v":"Beck                "},{"$f":"IF(ASV_Daten!C172=\"\",\"\",ASV_Daten!C172)","v":"Franz"},{"$f":"IF(ASV_Daten!D172=\"\",\"\",ASV_Daten!D172)","v":2009},{"$f":"IF(ASV_Daten!E172=\"\",\"\",ASV_Daten!E172)","v":"m"},"6cm",12,"12m",null,null,null,null,null,null,null,null,null,null,false,"nix"]
[{"$f":"IF(ASV_Daten!A173=\"\",\"\",ASV_Daten!A173)","v":"6c"},{"$f":"IF(ASV_Daten!B173=\"\",\"\",ASV_Daten!B173)","v":"Bäter"},{"$f":"IF(ASV_Daten!C173=\"\",\"\",ASV_Daten!C173)","v":"Stella"},{"$f":"IF(ASV_Daten!D173=\"\",\"\",ASV_Daten!D173)","v":2011},{"$f":"IF(ASV_Daten!E173=\"\",\"\",ASV_Daten!E173)","v":"w"},"6cw",10,"10w",null,null,null,null,null,null,null,null,null,null,false,"nix"]
[{"$f":"IF(ASV_Daten!A174=\"\",\"\",ASV_Daten!A174)","v":"6c"},{"$f":"IF(ASV_Daten!B174=\"\",\"\",ASV_Daten!B174)","v":"Brüssing"},{"$f":"IF(ASV_Daten!C174=\"\",\"\",ASV_Daten!C174)","v":"Philipp"},{"$f":"IF(ASV_Daten!D174=\"\",\"\",ASV_Daten!D174)","v":2011},{"$f":"IF(ASV_Daten!E174=\"\",\"\",ASV_Daten!E174)","v":"m"},"6cm",10,"10m",null,null,null,null,null,null,null,null,null,null,false,"nix"]
[{"$f":"IF(ASV_Daten!A175=\"\",\"\",ASV_Daten!A175)","v":"6c"},{"$f":"IF(ASV_Daten!B175=\"\",\"\",ASV_Daten!B175)","v":"Rollas"},{"$f":"IF(ASV_Daten!C175=\"\",\"\",ASV_Daten!C175)","v":"Gerd"},{"$f":"IF(ASV_Daten!D175=\"\",\"\",ASV_Daten!D175)","v":2011},{"$f":"IF(ASV_Daten!E175=\"\",\"\",ASV_Daten!E175)","v":"m"},"6cm",10,"10m",null,null,null,null,null,null,null,null,null,null,false,"nix"]
[{"$f":"IF(ASV_Daten!A176=\"\",\"\",ASV_Daten!A176)","v":"6c"},{"$f":"IF(ASV_Daten!B176=\"\",\"\",ASV_Daten!B176)","v":"Gerlach"},{"$f":"IF(ASV_Daten!C176=\"\",\"\",ASV_Daten!C176)","v":"Siegfried"},{"$f":"IF(ASV_Daten!D176=\"\",\"\",ASV_Daten!D176)","v":2011},{"$f":"IF(ASV_Daten!E176=\"\",\"\",ASV_Daten!E176)","v":"m"},"6cm",10,"10m",null,null,null,null,null,null,null,null,null,null,false,"nix"]
[{"$f":"IF(ASV_Daten!A177=\"\",\"\",ASV_Daten!A177)","v":"6c"},{"$f":"IF(ASV_Daten!B177=\"\",\"\",ASV_Daten!B177)","v":"Althaus             "},{"$f":"IF(ASV_Daten!C177=\"\",\"\",ASV_Daten!C177)","v":"Christa"},{"$f":"IF(ASV_Daten!D177=\"\",\"\",ASV_Daten!D177)","v":2009},{"$f":"IF(ASV_Daten!E177=\"\",\"\",ASV_Daten!E177)","v":"w"},"6cw",12,"12w",null,null,null,null,null,null,null,null,null,null,false,"nix"]
[{"$f":"IF(ASV_Daten!A178=\"\",\"\",ASV_Daten!A178)","v":"6c"},{"$f":"IF(ASV_Daten!B178=\"\",\"\",ASV_Daten!B178)","v":"Alt                 "},{"$f":"IF(ASV_Daten!C178=\"\",\"\",ASV_Daten!C178)","v":"Julia"},{"$f":"IF(ASV_Daten!D178=\"\",\"\",ASV_Daten!D178)","v":2009},{"$f":"IF(ASV_Daten!E178=\"\",\"\",ASV_Daten!E178)","v":"w"},"6cw",12,"12w",null,null,null,null,null,null,null,null,null,null,false,"nix"]
[{"$f":"IF(ASV_Daten!A179=\"\",\"\",ASV_Daten!A179)","v":"6c"},{"$f":"IF(ASV_Daten!B179=\"\",\"\",ASV_Daten!B179)","v":"Andersen            "},{"$f":"IF(ASV_Daten!C179=\"\",\"\",ASV_Daten!C179)","v":"Thomas"},{"$f":"IF(ASV_Daten!D179=\"\",\"\",ASV_Daten!D179)","v":2009},{"$f":"IF(ASV_Daten!E179=\"\",\"\",ASV_Daten!E179)","v":"m"},"6cm",12,"12m",null,null,null,null,null,null,null,null,null,null,false,"nix"]
[{"$f":"IF(ASV_Daten!A180=\"\",\"\",ASV_Daten!A180)","v":"6c"},{"$f":"IF(ASV_Daten!B180=\"\",\"\",ASV_Daten!B180)","v":"Becker              "},{"$f":"IF(ASV_Daten!C180=\"\",\"\",ASV_Daten!C180)","v":"Carola"},{"$f":"IF(ASV_Daten!D180=\"\",\"\",ASV_Daten!D180)","v":2009},{"$f":"IF(ASV_Daten!E180=\"\",\"\",ASV_Daten!E180)","v":"w"},"6cw",12,"12w",null,null,null,null,null,null,null,null,null,null,false,"nix"]
[{"$f":"IF(ASV_Daten!A181=\"\",\"\",ASV_Daten!A181)","v":"6c"},{"$f":"IF(ASV_Daten!B181=\"\",\"\",ASV_Daten!B181)","v":"Beck                "},{"$f":"IF(ASV_Daten!C181=\"\",\"\",ASV_Daten!C181)","v":"Franz"},{"$f":"IF(ASV_Daten!D181=\"\",\"\",ASV_Daten!D181)","v":2009},{"$f":"IF(ASV_Daten!E181=\"\",\"\",ASV_Daten!E181)","v":"m"},"6cm",12,"12m",null,null,null,null,null,null,null,null,null,null,false,"nix"]
[{"$f":"IF(ASV_Daten!A182=\"\",\"\",ASV_Daten!A182)","v":"6d"},{"$f":"IF(ASV_Daten!B182=\"\",\"\",ASV_Daten!B182)","v":"Meyer               "},{"$f":"IF(ASV_Daten!C182=\"\",\"\",ASV_Daten!C182)","v":"Jutta"},{"$f":"IF(ASV_Daten!D182=\"\",\"\",ASV_Daten!D182)","v":2009},{"$f":"IF(ASV_Daten!E182=\"\",\"\",ASV_Daten!E182)","v":"w"},"6dw",12,"12w",null,null,null,null,null,null,null,null,null,null,false,"nix"]
[{"$f":"IF(ASV_Daten!A183=\"\",\"\",ASV_Daten!A183)","v":"6d"},{"$f":"IF(ASV_Daten!B183=\"\",\"\",ASV_Daten!B183)","v":"Müller              "},{"$f":"IF(ASV_Daten!C183=\"\",\"\",ASV_Daten!C183)","v":"Tanja"},{"$f":"IF(ASV_Daten!D183=\"\",\"\",ASV_Daten!D183)","v":2009},{"$f":"IF(ASV_Daten!E183=\"\",\"\",ASV_Daten!E183)","v":"w"},"6dw",12,"12w",null,null,null,null,null,null,null,null,null,null,false,"nix"]
[{"$f":"IF(ASV_Daten!A184=\"\",\"\",ASV_Daten!A184)","v":"6d"},{"$f":"IF(ASV_Daten!B184=\"\",\"\",ASV_Daten!B184)","v":"Meisner             "},{"$f":"IF(ASV_Daten!C184=\"\",\"\",ASV_Daten!C184)","v":"wilfried"},{"$f":"IF(ASV_Daten!D184=\"\",\"\",ASV_Daten!D184)","v":2010},{"$f":"IF(ASV_Daten!E184=\"\",\"\",ASV_Daten!E184)","v":"m"},"6dm",11,"11m",null,null,null,null,null,null,null,null,null,null,false,"nix"]
[{"$f":"IF(ASV_Daten!A185=\"\",\"\",ASV_Daten!A185)","v":"6d"},{"$f":"IF(ASV_Daten!B185=\"\",\"\",ASV_Daten!B185)","v":"Petersen            "},{"$f":"IF(ASV_Daten!C185=\"\",\"\",ASV_Daten!C185)","v":"Günter"},{"$f":"IF(ASV_Daten!D185=\"\",\"\",ASV_Daten!D185)","v":2010},{"$f":"IF(ASV_Daten!E185=\"\",\"\",ASV_Daten!E185)","v":"m"},"6dm",11,"11m",null,null,null,null,null,null,null,null,null,null,false,"nix"]
[{"$f":"IF(ASV_Daten!A186=\"\",\"\",ASV_Daten!A186)","v":"6d"},{"$f":"IF(ASV_Daten!B186=\"\",\"\",ASV_Daten!B186)","v":"Pilowski            "},{"$f":"IF(ASV_Daten!C186=\"\",\"\",ASV_Daten!C186)","v":"Heike"},{"$f":"IF(ASV_Daten!D186=\"\",\"\",ASV_Daten!D186)","v":2010},{"$f":"IF(ASV_Daten!E186=\"\",\"\",ASV_Daten!E186)","v":"w"},"6dw",11,"11w",null,null,null,null,null,null,null,null,null,null,false,"nix"]
[{"$f":"IF(ASV_Daten!A187=\"\",\"\",ASV_Daten!A187)","v":"6d"},{"$f":"IF(ASV_Daten!B187=\"\",\"\",ASV_Daten!B187)","v":"Pausch              "},{"$f":"IF(ASV_Daten!C187=\"\",\"\",ASV_Daten!C187)","v":"Jens"},{"$f":"IF(ASV_Daten!D187=\"\",\"\",ASV_Daten!D187)","v":2010},{"$f":"IF(ASV_Daten!E187=\"\",\"\",ASV_Daten!E187)","v":"m"},"6dm",11,"11m",null,null,null,null,null,null,null,null,null,null,false,"nix"]
[{"$f":"IF(ASV_Daten!A188=\"\",\"\",ASV_Daten!A188)","v":"6d"},{"$f":"IF(ASV_Daten!B188=\"\",\"\",ASV_Daten!B188)","v":"Schösser            "},{"$f":"IF(ASV_Daten!C188=\"\",\"\",ASV_Daten!C188)","v":"Bernd"},{"$f":"IF(ASV_Daten!D188=\"\",\"\",ASV_Daten!D188)","v":2010},{"$f":"IF(ASV_Daten!E188=\"\",\"\",ASV_Daten!E188)","v":"m"},"6dm",11,"11m",null,null,null,null,null,null,null,null,null,null,false,"nix"]
[{"$f":"IF(ASV_Daten!A189=\"\",\"\",ASV_Daten!A189)","v":"6d"},{"$f":"IF(ASV_Daten!B189=\"\",\"\",ASV_Daten!B189)","v":"Schmidt             "},{"$f":"IF(ASV_Daten!C189=\"\",\"\",ASV_Daten!C189)","v":"Karl"},{"$f":"IF(ASV_Daten!D189=\"\",\"\",ASV_Daten!D189)","v":2009},{"$f":"IF(ASV_Daten!E189=\"\",\"\",ASV_Daten!E189)","v":"m"},"6dm",12,"12m",null,null,null,null,null,null,null,null,null,null,false,"nix"]
[{"$f":"IF(ASV_Daten!A190=\"\",\"\",ASV_Daten!A190)","v":"6d"},{"$f":"IF(ASV_Daten!B190=\"\",\"\",ASV_Daten!B190)","v":"Schützer            "},{"$f":"IF(ASV_Daten!C190=\"\",\"\",ASV_Daten!C190)","v":"Ulf"},{"$f":"IF(ASV_Daten!D190=\"\",\"\",ASV_Daten!D190)","v":2009},{"$f":"IF(ASV_Daten!E190=\"\",\"\",ASV_Daten!E190)","v":"m"},"6dm",12,"12m",null,null,null,null,null,null,null,null,null,null,false,"nix"]
[{"$f":"IF(ASV_Daten!A191=\"\",\"\",ASV_Daten!A191)","v":"6d"},{"$f":"IF(ASV_Daten!B191=\"\",\"\",ASV_Daten!B191)","v":"Tönje               "},{"$f":"IF(ASV_Daten!C191=\"\",\"\",ASV_Daten!C191)","v":"Christoph"},{"$f":"IF(ASV_Daten!D191=\"\",\"\",ASV_Daten!D191)","v":2009},{"$f":"IF(ASV_Daten!E191=\"\",\"\",ASV_Daten!E191)","v":"m"},"6dm",12,"12m",null,null,null,null,null,null,null,null,null,null,false,"nix"]
[{"$f":"IF(ASV_Daten!A192=\"\",\"\",ASV_Daten!A192)","v":"6d"},{"$f":"IF(ASV_Daten!B192=\"\",\"\",ASV_Daten!B192)","v":"Meyer               "},{"$f":"IF(ASV_Daten!C192=\"\",\"\",ASV_Daten!C192)","v":"Jutta"},{"$f":"IF(ASV_Daten!D192=\"\",\"\",ASV_Daten!D192)","v":2009},{"$f":"IF(ASV_Daten!E192=\"\",\"\",ASV_Daten!E192)","v":"w"},"6dw",12,"12w",null,null,null,null,null,null,null,null,null,null,false,"nix"]
[{"$f":"IF(ASV_Daten!A193=\"\",\"\",ASV_Daten!A193)","v":"6d"},{"$f":"IF(ASV_Daten!B193=\"\",\"\",ASV_Daten!B193)","v":"Müller              "},{"$f":"IF(ASV_Daten!C193=\"\",\"\",ASV_Daten!C193)","v":"Tanja"},{"$f":"IF(ASV_Daten!D193=\"\",\"\",ASV_Daten!D193)","v":2009},{"$f":"IF(ASV_Daten!E193=\"\",\"\",ASV_Daten!E193)","v":"w"},"6dw",12,"12w",null,null,null,null,null,null,null,null,null,null,false,"nix"]
[{"$f":"IF(ASV_Daten!A194=\"\",\"\",ASV_Daten!A194)","v":"6d"},{"$f":"IF(ASV_Daten!B194=\"\",\"\",ASV_Daten!B194)","v":"Meisner             "},{"$f":"IF(ASV_Daten!C194=\"\",\"\",ASV_Daten!C194)","v":"wilfried"},{"$f":"IF(ASV_Daten!D194=\"\",\"\",ASV_Daten!D194)","v":2010},{"$f":"IF(ASV_Daten!E194=\"\",\"\",ASV_Daten!E194)","v":"m"},"6dm",11,"11m",null,null,null,null,null,null,null,null,null,null,false,"nix"]
[{"$f":"IF(ASV_Daten!A195=\"\",\"\",ASV_Daten!A195)","v":"6d"},{"$f":"IF(ASV_Daten!B195=\"\",\"\",ASV_Daten!B195)","v":"Petersen            "},{"$f":"IF(ASV_Daten!C195=\"\",\"\",ASV_Daten!C195)","v":"Günter"},{"$f":"IF(ASV_Daten!D195=\"\",\"\",ASV_Daten!D195)","v":2010},{"$f":"IF(ASV_Daten!E195=\"\",\"\",ASV_Daten!E195)","v":"m"},"6dm",11,"11m",null,null,null,null,null,null,null,null,null,null,false,"nix"]
[{"$f":"IF(ASV_Daten!A196=\"\",\"\",ASV_Daten!A196)","v":"6d"},{"$f":"IF(ASV_Daten!B196=\"\",\"\",ASV_Daten!B196)","v":"Pilowski            "},{"$f":"IF(ASV_Daten!C196=\"\",\"\",ASV_Daten!C196)","v":"Heike"},{"$f":"IF(ASV_Daten!D196=\"\",\"\",ASV_Daten!D196)","v":2010},{"$f":"IF(ASV_Daten!E196=\"\",\"\",ASV_Daten!E196)","v":"w"},"6dw",11,"11w",null,null,null,null,null,null,null,null,null,null,false,"nix"]
[{"$f":"IF(ASV_Daten!A197=\"\",\"\",ASV_Daten!A197)","v":"6d"},{"$f":"IF(ASV_Daten!B197=\"\",\"\",ASV_Daten!B197)","v":"Pausch              "},{"$f":"IF(ASV_Daten!C197=\"\",\"\",ASV_Daten!C197)","v":"Jens"},{"$f":"IF(ASV_Daten!D197=\"\",\"\",ASV_Daten!D197)","v":2010},{"$f":"IF(ASV_Daten!E197=\"\",\"\",ASV_Daten!E197)","v":"m"},"6dm",11,"11m",null,null,null,null,null,null,null,null,null,null,false,"nix"]
[{"$f":"IF(ASV_Daten!A198=\"\",\"\",ASV_Daten!A198)","v":"6d"},{"$f":"IF(ASV_Daten!B198=\"\",\"\",ASV_Daten!B198)","v":"Schösser            "},{"$f":"IF(ASV_Daten!C198=\"\",\"\",ASV_Daten!C198)","v":"Bernd"},{"$f":"IF(ASV_Daten!D198=\"\",\"\",ASV_Daten!D198)","v":2010},{"$f":"IF(ASV_Daten!E198=\"\",\"\",ASV_Daten!E198)","v":"m"},"6dm",11,"11m",null,null,null,null,null,null,null,null,null,null,false,"nix"]
[{"$f":"IF(ASV_Daten!A199=\"\",\"\",ASV_Daten!A199)","v":"6d"},{"$f":"IF(ASV_Daten!B199=\"\",\"\",ASV_Daten!B199)","v":"Schmidt             "},{"$f":"IF(ASV_Daten!C199=\"\",\"\",ASV_Daten!C199)","v":"Karl"},{"$f":"IF(ASV_Daten!D199=\"\",\"\",ASV_Daten!D199)","v":2009},{"$f":"IF(ASV_Daten!E199=\"\",\"\",ASV_Daten!E199)","v":"m"},"6dm",12,"12m",null,null,null,null,null,null,null,null,null,null,false,"nix"]
[{"$f":"IF(ASV_Daten!A200=\"\",\"\",ASV_Daten!A200)","v":"6d"},{"$f":"IF(ASV_Daten!B200=\"\",\"\",ASV_Daten!B200)","v":"Schützer            "},{"$f":"IF(ASV_Daten!C200=\"\",\"\",ASV_Daten!C200)","v":"Ulf"},{"$f":"IF(ASV_Daten!D200=\"\",\"\",ASV_Daten!D200)","v":2009},{"$f":"IF(ASV_Daten!E200=\"\",\"\",ASV_Daten!E200)","v":"m"},"6dm",12,"12m",null,null,null,null,null,null,null,null,null,null,false,"nix"]
[{"$f":"IF(ASV_Daten!A201=\"\",\"\",ASV_Daten!A201)","v":"6d"},{"$f":"IF(ASV_Daten!B201=\"\",\"\",ASV_Daten!B201)","v":"Tönje               "},{"$f":"IF(ASV_Daten!C201=\"\",\"\",ASV_Daten!C201)","v":"Christoph"},{"$f":"IF(ASV_Daten!D201=\"\",\"\",ASV_Daten!D201)","v":2009},{"$f":"IF(ASV_Daten!E201=\"\",\"\",ASV_Daten!E201)","v":"m"},"6dm",12,"12m",null,null,null,null,null,null,null,null,null,null,false,"nix"]
[{"$f":"IF(ASV_Daten!A202=\"\",\"\",ASV_Daten!A202)","v":"6d"},{"$f":"IF(ASV_Daten!B202=\"\",\"\",ASV_Daten!B202)","v":"Meyer               "},{"$f":"IF(ASV_Daten!C202=\"\",\"\",ASV_Daten!C202)","v":"Jutta"},{"$f":"IF(ASV_Daten!D202=\"\",\"\",ASV_Daten!D202)","v":2009},{"$f":"IF(ASV_Daten!E202=\"\",\"\",ASV_Daten!E202)","v":"w"},"6dw",12,"12w",null,null,null,null,null,null,null,null,null,null,false,"nix"]
[{"$f":"IF(ASV_Daten!A203=\"\",\"\",ASV_Daten!A203)","v":"6d"},{"$f":"IF(ASV_Daten!B203=\"\",\"\",ASV_Daten!B203)","v":"Müller              "},{"$f":"IF(ASV_Daten!C203=\"\",\"\",ASV_Daten!C203)","v":"Tanja"},{"$f":"IF(ASV_Daten!D203=\"\",\"\",ASV_Daten!D203)","v":2009},{"$f":"IF(ASV_Daten!E203=\"\",\"\",ASV_Daten!E203)","v":"w"},"6dw",12,"12w",null,null,null,null,null,null,null,null,null,null,false,"nix"]
[{"$f":"IF(ASV_Daten!A204=\"\",\"\",ASV_Daten!A204)","v":"6d"},{"$f":"IF(ASV_Daten!B204=\"\",\"\",ASV_Daten!B204)","v":"Meisner             "},{"$f":"IF(ASV_Daten!C204=\"\",\"\",ASV_Daten!C204)","v":"wilfried"},{"$f":"IF(ASV_Daten!D204=\"\",\"\",ASV_Daten!D204)","v":2010},{"$f":"IF(ASV_Daten!E204=\"\",\"\",ASV_Daten!E204)","v":"m"},"6dm",11,"11m",null,null,null,null,null,null,null,null,null,null,false,"nix"]
[{"$f":"IF(ASV_Daten!A205=\"\",\"\",ASV_Daten!A205)","v":"6d"},{"$f":"IF(ASV_Daten!B205=\"\",\"\",ASV_Daten!B205)","v":"Petersen            "},{"$f":"IF(ASV_Daten!C205=\"\",\"\",ASV_Daten!C205)","v":"Günter"},{"$f":"IF(ASV_Daten!D205=\"\",\"\",ASV_Daten!D205)","v":2010},{"$f":"IF(ASV_Daten!E205=\"\",\"\",ASV_Daten!E205)","v":"m"},"6dm",11,"11m",null,null,null,null,null,null,null,null,null,null,false,"nix"]
[{"$f":"IF(ASV_Daten!A206=\"\",\"\",ASV_Daten!A206)","v":"6d"},{"$f":"IF(ASV_Daten!B206=\"\",\"\",ASV_Daten!B206)","v":"Pilowski            "},{"$f":"IF(ASV_Daten!C206=\"\",\"\",ASV_Daten!C206)","v":"Heike"},{"$f":"IF(ASV_Daten!D206=\"\",\"\",ASV_Daten!D206)","v":2010},{"$f":"IF(ASV_Daten!E206=\"\",\"\",ASV_Daten!E206)","v":"w"},"6dw",11,"11w",null,null,null,null,null,null,null,null,null,null,false,"nix"]
[{"$f":"IF(ASV_Daten!A207=\"\",\"\",ASV_Daten!A207)","v":"6d"},{"$f":"IF(ASV_Daten!B207=\"\",\"\",ASV_Daten!B207)","v":"Pausch              "},{"$f":"IF(ASV_Daten!C207=\"\",\"\",ASV_Daten!C207)","v":"Jens"},{"$f":"IF(ASV_Daten!D207=\"\",\"\",ASV_Daten!D207)","v":2010},{"$f":"IF(ASV_Daten!E207=\"\",\"\",ASV_Daten!E207)","v":"m"},"6dm",11,"11m",null,null,null,null,null,null,null,null,null,null,false,"nix"]
[{"$f":"IF(ASV_Daten!A208=\"\",\"\",ASV_Daten!A208)","v":"6d"},{"$f":"IF(ASV_Daten!B208=\"\",\"\",ASV_Daten!B208)","v":"Schösser            "},{"$f":"IF(ASV_Daten!C208=\"\",\"\",ASV_Daten!C208)","v":"Bernd"},{"$f":"IF(ASV_Daten!D208=\"\",\"\",ASV_Daten!D208)","v":2010},{"$f":"IF(ASV_Daten!E208=\"\",\"\",ASV_Daten!E208)","v":"m"},"6dm",11,"11m",null,null,null,null,null,null,null,null,null,null,false,"nix"]
[{"$f":"IF(ASV_Daten!A209=\"\",\"\",ASV_Daten!A209)","v":"6d"},{"$f":"IF(ASV_Daten!B209=\"\",\"\",ASV_Daten!B209)","v":"Schmidt             "},{"$f":"IF(ASV_Daten!C209=\"\",\"\",ASV_Daten!C209)","v":"Karl"},{"$f":"IF(ASV_Daten!D209=\"\",\"\",ASV_Daten!D209)","v":2009},{"$f":"IF(ASV_Daten!E209=\"\",\"\",ASV_Daten!E209)","v":"m"},"6dm",12,"12m",null,null,null,null,null,null,null,null,null,null,false,"nix"]
[{"$f":"IF(ASV_Daten!A210=\"\",\"\",ASV_Daten!A210)","v":"6d"},{"$f":"IF(ASV_Daten!B210=\"\",\"\",ASV_Daten!B210)","v":"Schützer            "},{"$f":"IF(ASV_Daten!C210=\"\",\"\",ASV_Daten!C210)","v":"Ulf"},{"$f":"IF(ASV_Daten!D210=\"\",\"\",ASV_Daten!D210)","v":2009},{"$f":"IF(ASV_Daten!E210=\"\",\"\",ASV_Daten!E210)","v":"m"},"6dm",12,"12m",null,null,null,null,null,null,null,null,null,null,false,"nix"]
[{"$f":"IF(ASV_Daten!A211=\"\",\"\",ASV_Daten!A211)","v":"6d"},{"$f":"IF(ASV_Daten!B211=\"\",\"\",ASV_Daten!B211)","v":"Tönje               "},{"$f":"IF(ASV_Daten!C211=\"\",\"\",ASV_Daten!C211)","v":"Christoph"},{"$f":"IF(ASV_Daten!D211=\"\",\"\",ASV_Daten!D211)","v":2009},{"$f":"IF(ASV_Daten!E211=\"\",\"\",ASV_Daten!E211)","v":"m"},"6dm",12,"12m",null,null,null,null,null,null,null,null,null,null,false,"nix"]
[{"$f":"IF(ASV_Daten!A212=\"\",\"\",ASV_Daten!A212)","v":"7a"},{"$f":"IF(ASV_Daten!B212=\"\",\"\",ASV_Daten!B212)","v":"Zeug                "},{"$f":"IF(ASV_Daten!C212=\"\",\"\",ASV_Daten!C212)","v":"Konrad"},{"$f":"IF(ASV_Daten!D212=\"\",\"\",ASV_Daten!D212)","v":2009},{"$f":"IF(ASV_Daten!E212=\"\",\"\",ASV_Daten!E212)","v":"m"},"7am",12,"12m",null,null,null,null,null,null,null,null,null,null,{"$f":"IF(AND(A213=\"1a\",E213=\"m\"),\"N1m\",IF(AND(A213=\"1a\",E213=\"w\"),\"N1w\",IF(AND(A213=\"1b\",E213=\"w\"),\"N1w\",IF(AND(A213=\"1b\",E213=\"m\"),\"N1m\",IF(AND(A213=\"2a\",E213=\"m\"),\"N2m\",IF(AND(A213=\"2a\",E213=\"w\"),\"N2w\",IF(AND(A213=\"2b\",E213=\"w\"),\"N2w\",IF(AND(A213=\"2b\",E213=\"m\"),\"N2m\",IF(AND(A213=\"3a\",E213=\"m\"),\"N3m\",IF(AND(A213=\"3a\",E213=\"w\"),\"N3w\",IF(AND(A213=\"3b\",E213=\"w\"),\"N3w\",IF(AND(A213=\"3b\",E213=\"m\"),\"N3m\",IF(AND(A213=\"4a\",E213=\"m\"),\"N4m\",IF(AND(A213=\"4a\",E213=\"w\"),\"N4w\",IF(AND(A213=\"4b\",E213=\"m\"),\"N4m\",IF(AND(A213=\"4b\",E213=\"w\"),\"N4w\"))))))))))))))))","v":false},{"$f":"IF(S213=\"n1m\",VLOOKUP(Q213,N1m,2),IF(S213=\"N1w\",VLOOKUP(Q213,N1w,2),IF(S213=\"N2m\",VLOOKUP(Q213,n2m,2),IF(S213=\"N2w\",VLOOKUP(Q213,n2w,2),IF(S213=\"N3w\",VLOOKUP(Q213,n3w,2),IF(S213=\"N3m\",VLOOKUP(Q213,n3m,2),IF(S213=\"N4w\",VLOOKUP(Q213,n4w,2),IF(S213=\"N4m\",VLOOKUP(Q213,n4m,2),\"nix\"))))))))","v":"nix"}]
[{"$f":"IF(ASV_Daten!A213=\"\",\"\",ASV_Daten!A213)","v":"7a"},{"$f":"IF(ASV_Daten!B213=\"\",\"\",ASV_Daten!B213)","v":"weiss"},{"$f":"IF(ASV_Daten!C213=\"\",\"\",ASV_Daten!C213)","v":"Hannes"},{"$f":"IF(ASV_Daten!D213=\"\",\"\",ASV_Daten!D213)","v":2009},{"$f":"IF(ASV_Daten!E213=\"\",\"\",ASV_Daten!E213)","v":"m"},"7am",12,"12m",null,null,null,null,null,null,null,null,null,null,false,"nix"]
[{"$f":"IF(ASV_Daten!A214=\"\",\"\",ASV_Daten!A214)","v":"7a"},{"$f":"IF(ASV_Daten!B214=\"\",\"\",ASV_Daten!B214)","v":"Berger"},{"$f":"IF(ASV_Daten!C214=\"\",\"\",ASV_Daten!C214)","v":"Franz"},{"$f":"IF(ASV_Daten!D214=\"\",\"\",ASV_Daten!D214)","v":2009},{"$f":"IF(ASV_Daten!E214=\"\",\"\",ASV_Daten!E214)","v":"m"},"7am",12,"12m",null,null,null,null,null,null,null,null,null,null,false,"nix"]
[{"$f":"IF(ASV_Daten!A215=\"\",\"\",ASV_Daten!A215)","v":"7a"},{"$f":"IF(ASV_Daten!B215=\"\",\"\",ASV_Daten!B215)","v":"Schwarz"},{"$f":"IF(ASV_Daten!C215=\"\",\"\",ASV_Daten!C215)","v":"Albert"},{"$f":"IF(ASV_Daten!D215=\"\",\"\",ASV_Daten!D215)","v":2009},{"$f":"IF(ASV_Daten!E215=\"\",\"\",ASV_Daten!E215)","v":"w"},{"$f":"A216&E216","v":"7aw"},{"$f":"IF(D216=\"\",\"\",$B$1-$D216)","v":12},{"$f":"G216&E216","v":"12w"},null,null,null,null,null,null,null,null,null,null,false,"nix"]
[{"$f":"IF(ASV_Daten!A216=\"\",\"\",ASV_Daten!A216)","v":"7a"},{"$f":"IF(ASV_Daten!B216=\"\",\"\",ASV_Daten!B216)","v":"Herrmann"},{"$f":"IF(ASV_Daten!C216=\"\",\"\",ASV_Daten!C216)","v":"Petra"},{"$f":"IF(ASV_Daten!D216=\"\",\"\",ASV_Daten!D216)","v":2009},{"$f":"IF(ASV_Daten!E216=\"\",\"\",ASV_Daten!E216)","v":"m"},"7am",12,"12m",null,null,null,null,null,null,null,null,null,null,false,"nix"]
[{"$f":"IF(ASV_Daten!A217=\"\",\"\",ASV_Daten!A217)","v":"7a"},{"$f":"IF(ASV_Daten!B217=\"\",\"\",ASV_Daten!B217)","v":"Huber"},{"$f":"IF(ASV_Daten!C217=\"\",\"\",ASV_Daten!C217)","v":"Maximilian"},{"$f":"IF(ASV_Daten!D217=\"\",\"\",ASV_Daten!D217)","v":2009},{"$f":"IF(ASV_Daten!E217=\"\",\"\",ASV_Daten!E217)","v":"w"},"7aw",12,"12w",null,null,null,null,null,null,null,null,null,null,false,"nix"]
[{"$f":"IF(ASV_Daten!A218=\"\",\"\",ASV_Daten!A218)","v":"7a"},{"$f":"IF(ASV_Daten!B218=\"\",\"\",ASV_Daten!B218)","v":"Meier"},{"$f":"IF(ASV_Daten!C218=\"\",\"\",ASV_Daten!C218)","v":"Helga"},{"$f":"IF(ASV_Daten!D218=\"\",\"\",ASV_Daten!D218)","v":2009},{"$f":"IF(ASV_Daten!E218=\"\",\"\",ASV_Daten!E218)","v":"w"},"7aw",12,"12w",null,null,null,null,null,null,null,null,null,null,false,"nix"]
[{"$f":"IF(ASV_Daten!A219=\"\",\"\",ASV_Daten!A219)","v":"7a"},{"$f":"IF(ASV_Daten!B219=\"\",\"\",ASV_Daten!B219)","v":"Dorfmeister"},{"$f":"IF(ASV_Daten!C219=\"\",\"\",ASV_Daten!C219)","v":"Sabine"},{"$f":"IF(ASV_Daten!D219=\"\",\"\",ASV_Daten!D219)","v":2009},{"$f":"IF(ASV_Daten!E219=\"\",\"\",ASV_Daten!E219)","v":"m"},"7am",12,"12m",null,null,null,null,null,null,null,null,null,null,false,"nix"]
[{"$f":"IF(ASV_Daten!A220=\"\",\"\",ASV_Daten!A220)","v":"7a"},{"$f":"IF(ASV_Daten!B220=\"\",\"\",ASV_Daten!B220)","v":"Mayr"},{"$f":"IF(ASV_Daten!C220=\"\",\"\",ASV_Daten!C220)","v":"Herbert"},{"$f":"IF(ASV_Daten!D220=\"\",\"\",ASV_Daten!D220)","v":2009},{"$f":"IF(ASV_Daten!E220=\"\",\"\",ASV_Daten!E220)","v":"m"},"7am",12,"12m",null,null,null,null,null,null,null,null,null,null,false,"nix"]
[{"$f":"IF(ASV_Daten!A221=\"\",\"\",ASV_Daten!A221)","v":"7a"},{"$f":"IF(ASV_Daten!B221=\"\",\"\",ASV_Daten!B221)","v":"Zeug                "},{"$f":"IF(ASV_Daten!C221=\"\",\"\",ASV_Daten!C221)","v":"Konrad"},{"$f":"IF(ASV_Daten!D221=\"\",\"\",ASV_Daten!D221)","v":2009},{"$f":"IF(ASV_Daten!E221=\"\",\"\",ASV_Daten!E221)","v":"m"},"7am",12,"12m",null,null,null,null,null,null,null,null,null,null,false,"nix"]
[{"$f":"IF(ASV_Daten!A222=\"\",\"\",ASV_Daten!A222)","v":"7a"},{"$f":"IF(ASV_Daten!B222=\"\",\"\",ASV_Daten!B222)","v":"weiss"},{"$f":"IF(ASV_Daten!C222=\"\",\"\",ASV_Daten!C222)","v":"Hannes"},{"$f":"IF(ASV_Daten!D222=\"\",\"\",ASV_Daten!D222)","v":2009},{"$f":"IF(ASV_Daten!E222=\"\",\"\",ASV_Daten!E222)","v":"m"},"7am",12,"12m",null,null,null,null,null,null,null,null,null,null,false,"nix"]
[{"$f":"IF(ASV_Daten!A223=\"\",\"\",ASV_Daten!A223)","v":"7a"},{"$f":"IF(ASV_Daten!B223=\"\",\"\",ASV_Daten!B223)","v":"Berger"},{"$f":"IF(ASV_Daten!C223=\"\",\"\",ASV_Daten!C223)","v":"Franz"},{"$f":"IF(ASV_Daten!D223=\"\",\"\",ASV_Daten!D223)","v":2009},{"$f":"IF(ASV_Daten!E223=\"\",\"\",ASV_Daten!E223)","v":"m"},"7am",12,"12m",null,null,null,null,null,null,null,null,null,null,false,"nix"]
[{"$f":"IF(ASV_Daten!A224=\"\",\"\",ASV_Daten!A224)","v":"7a"},{"$f":"IF(ASV_Daten!B224=\"\",\"\",ASV_Daten!B224)","v":"Schwarz"},{"$f":"IF(ASV_Daten!C224=\"\",\"\",ASV_Daten!C224)","v":"Albert"},{"$f":"IF(ASV_Daten!D224=\"\",\"\",ASV_Daten!D224)","v":2009},{"$f":"IF(ASV_Daten!E224=\"\",\"\",ASV_Daten!E224)","v":"w"},"7aw",12,"12w",null,null,null,null,null,null,null,null,null,null,false,"nix"]
[{"$f":"IF(ASV_Daten!A225=\"\",\"\",ASV_Daten!A225)","v":"7a"},{"$f":"IF(ASV_Daten!B225=\"\",\"\",ASV_Daten!B225)","v":"Herrmann"},{"$f":"IF(ASV_Daten!C225=\"\",\"\",ASV_Daten!C225)","v":"Petra"},{"$f":"IF(ASV_Daten!D225=\"\",\"\",ASV_Daten!D225)","v":2009},{"$f":"IF(ASV_Daten!E225=\"\",\"\",ASV_Daten!E225)","v":"m"},"7am",12,"12m",null,null,null,null,null,null,null,null,null,null,false,"nix"]
[{"$f":"IF(ASV_Daten!A226=\"\",\"\",ASV_Daten!A226)","v":"7a"},{"$f":"IF(ASV_Daten!B226=\"\",\"\",ASV_Daten!B226)","v":"Huber"},{"$f":"IF(ASV_Daten!C226=\"\",\"\",ASV_Daten!C226)","v":"Maximilian"},{"$f":"IF(ASV_Daten!D226=\"\",\"\",ASV_Daten!D226)","v":2009},{"$f":"IF(ASV_Daten!E226=\"\",\"\",ASV_Daten!E226)","v":"w"},"7aw",12,"12w",null,null,null,null,null,null,null,null,null,null,false,"nix"]
[{"$f":"IF(ASV_Daten!A227=\"\",\"\",ASV_Daten!A227)","v":"7a"},{"$f":"IF(ASV_Daten!B227=\"\",\"\",ASV_Daten!B227)","v":"Meier"},{"$f":"IF(ASV_Daten!C227=\"\",\"\",ASV_Daten!C227)","v":"Helga"},{"$f":"IF(ASV_Daten!D227=\"\",\"\",ASV_Daten!D227)","v":2009},{"$f":"IF(ASV_Daten!E227=\"\",\"\",ASV_Daten!E227)","v":"w"},"7aw",12,"12w",null,null,null,null,null,null,null,null,null,null,false,"nix"]
[{"$f":"IF(ASV_Daten!A228=\"\",\"\",ASV_Daten!A228)","v":"7a"},{"$f":"IF(ASV_Daten!B228=\"\",\"\",ASV_Daten!B228)","v":"Dorfmeister"},{"$f":"IF(ASV_Daten!C228=\"\",\"\",ASV_Daten!C228)","v":"Sabine"},{"$f":"IF(ASV_Daten!D228=\"\",\"\",ASV_Daten!D228)","v":2009},{"$f":"IF(ASV_Daten!E228=\"\",\"\",ASV_Daten!E228)","v":"m"},"7am",12,"12m",null,null,null,null,null,null,null,null,null,null,false,"nix"]
[{"$f":"IF(ASV_Daten!A229=\"\",\"\",ASV_Daten!A229)","v":"7a"},{"$f":"IF(ASV_Daten!B229=\"\",\"\",ASV_Daten!B229)","v":"Mayr"},{"$f":"IF(ASV_Daten!C229=\"\",\"\",ASV_Daten!C229)","v":"Herbert"},{"$f":"IF(ASV_Daten!D229=\"\",\"\",ASV_Daten!D229)","v":2009},{"$f":"IF(ASV_Daten!E229=\"\",\"\",ASV_Daten!E229)","v":"m"},"7am",12,"12m",null,null,null,null,null,null,null,null,null,null,false,"nix"]
[{"$f":"IF(ASV_Daten!A230=\"\",\"\",ASV_Daten!A230)","v":"7a"},{"$f":"IF(ASV_Daten!B230=\"\",\"\",ASV_Daten!B230)","v":"Zeug                "},{"$f":"IF(ASV_Daten!C230=\"\",\"\",ASV_Daten!C230)","v":"Konrad"},{"$f":"IF(ASV_Daten!D230=\"\",\"\",ASV_Daten!D230)","v":2009},{"$f":"IF(ASV_Daten!E230=\"\",\"\",ASV_Daten!E230)","v":"m"},"7am",12,"12m",null,null,null,null,null,null,null,null,null,null,false,"nix"]
[{"$f":"IF(ASV_Daten!A231=\"\",\"\",ASV_Daten!A231)","v":"7a"},{"$f":"IF(ASV_Daten!B231=\"\",\"\",ASV_Daten!B231)","v":"weiss"},{"$f":"IF(ASV_Daten!C231=\"\",\"\",ASV_Daten!C231)","v":"Hannes"},{"$f":"IF(ASV_Daten!D231=\"\",\"\",ASV_Daten!D231)","v":2009},{"$f":"IF(ASV_Daten!E231=\"\",\"\",ASV_Daten!E231)","v":"m"},"7am",12,"12m",null,null,null,null,null,null,null,null,null,null,false,"nix"]
[{"$f":"IF(ASV_Daten!A232=\"\",\"\",ASV_Daten!A232)","v":"7a"},{"$f":"IF(ASV_Daten!B232=\"\",\"\",ASV_Daten!B232)","v":"Berger"},{"$f":"IF(ASV_Daten!C232=\"\",\"\",ASV_Daten!C232)","v":"Franz"},{"$f":"IF(ASV_Daten!D232=\"\",\"\",ASV_Daten!D232)","v":2009},{"$f":"IF(ASV_Daten!E232=\"\",\"\",ASV_Daten!E232)","v":"m"},"7am",12,"12m",null,null,null,null,null,null,null,null,null,null,false,"nix"]
[{"$f":"IF(ASV_Daten!A233=\"\",\"\",ASV_Daten!A233)","v":"7a"},{"$f":"IF(ASV_Daten!B233=\"\",\"\",ASV_Daten!B233)","v":"Schwarz"},{"$f":"IF(ASV_Daten!C233=\"\",\"\",ASV_Daten!C233)","v":"Albert"},{"$f":"IF(ASV_Daten!D233=\"\",\"\",ASV_Daten!D233)","v":2009},{"$f":"IF(ASV_Daten!E233=\"\",\"\",ASV_Daten!E233)","v":"w"},"7aw",12,"12w",null,null,null,null,null,null,null,null,null,null,false,"nix"]
[{"$f":"IF(ASV_Daten!A234=\"\",\"\",ASV_Daten!A234)","v":"7a"},{"$f":"IF(ASV_Daten!B234=\"\",\"\",ASV_Daten!B234)","v":"Herrmann"},{"$f":"IF(ASV_Daten!C234=\"\",\"\",ASV_Daten!C234)","v":"Petra"},{"$f":"IF(ASV_Daten!D234=\"\",\"\",ASV_Daten!D234)","v":2009},{"$f":"IF(ASV_Daten!E234=\"\",\"\",ASV_Daten!E234)","v":"m"},"7am",12,"12m",null,null,null,null,null,null,null,null,null,null,false,"nix"]
[{"$f":"IF(ASV_Daten!A235=\"\",\"\",ASV_Daten!A235)","v":"7a"},{"$f":"IF(ASV_Daten!B235=\"\",\"\",ASV_Daten!B235)","v":"Huber"},{"$f":"IF(ASV_Daten!C235=\"\",\"\",ASV_Daten!C235)","v":"Maximilian"},{"$f":"IF(ASV_Daten!D235=\"\",\"\",ASV_Daten!D235)","v":2009},{"$f":"IF(ASV_Daten!E235=\"\",\"\",ASV_Daten!E235)","v":"w"},"7aw",12,"12w",null,null,null,null,null,null,null,null,null,null,false,"nix"]
[{"$f":"IF(ASV_Daten!A236=\"\",\"\",ASV_Daten!A236)","v":"7a"},{"$f":"IF(ASV_Daten!B236=\"\",\"\",ASV_Daten!B236)","v":"Meier"},{"$f":"IF(ASV_Daten!C236=\"\",\"\",ASV_Daten!C236)","v":"Helga"},{"$f":"IF(ASV_Daten!D236=\"\",\"\",ASV_Daten!D236)","v":2009},{"$f":"IF(ASV_Daten!E236=\"\",\"\",ASV_Daten!E236)","v":"w"},"7aw",12,"12w",null,null,null,null,null,null,null,null,null,null,false,"nix"]
[{"$f":"IF(ASV_Daten!A237=\"\",\"\",ASV_Daten!A237)","v":"7a"},{"$f":"IF(ASV_Daten!B237=\"\",\"\",ASV_Daten!B237)","v":"Dorfmeister"},{"$f":"IF(ASV_Daten!C237=\"\",\"\",ASV_Daten!C237)","v":"Sabine"},{"$f":"IF(ASV_Daten!D237=\"\",\"\",ASV_Daten!D237)","v":2009},{"$f":"IF(ASV_Daten!E237=\"\",\"\",ASV_Daten!E237)","v":"m"},"7am",12,"12m",null,null,null,null,null,null,null,null,null,null,false,"nix"]
[{"$f":"IF(ASV_Daten!A238=\"\",\"\",ASV_Daten!A238)","v":"7a"},{"$f":"IF(ASV_Daten!B238=\"\",\"\",ASV_Daten!B238)","v":"Mayr"},{"$f":"IF(ASV_Daten!C238=\"\",\"\",ASV_Daten!C238)","v":"Herbert"},{"$f":"IF(ASV_Daten!D238=\"\",\"\",ASV_Daten!D238)","v":2009},{"$f":"IF(ASV_Daten!E238=\"\",\"\",ASV_Daten!E238)","v":"m"},"7am",12,"12m",null,null,null,null,null,null,null,null,null,null,false,"nix"]
[{"$f":"IF(ASV_Daten!A239=\"\",\"\",ASV_Daten!A239)","v":"7b"},{"$f":"IF(ASV_Daten!B239=\"\",\"\",ASV_Daten!B239)","v":"Lindner"},{"$f":"IF(ASV_Daten!C239=\"\",\"\",ASV_Daten!C239)","v":"Christian"},{"$f":"IF(ASV_Daten!D239=\"\",\"\",ASV_Daten!D239)","v":2008},{"$f":"IF(ASV_Daten!E239=\"\",\"\",ASV_Daten!E239)","v":"m"},"7bm",13,"13m",null,null,null,null,null,null,null,null,null,null,false,"nix"]
[{"$f":"IF(ASV_Daten!A240=\"\",\"\",ASV_Daten!A240)","v":"7b"},{"$f":"IF(ASV_Daten!B240=\"\",\"\",ASV_Daten!B240)","v":"Siener"},{"$f":"IF(ASV_Daten!C240=\"\",\"\",ASV_Daten!C240)","v":"Nadja"},{"$f":"IF(ASV_Daten!D240=\"\",\"\",ASV_Daten!D240)","v":2008},{"$f":"IF(ASV_Daten!E240=\"\",\"\",ASV_Daten!E240)","v":"w"},"7bw",13,"13w",null,null,null,null,null,null,null,null,null,null,false,"nix"]
[{"$f":"IF(ASV_Daten!A241=\"\",\"\",ASV_Daten!A241)","v":"7b"},{"$f":"IF(ASV_Daten!B241=\"\",\"\",ASV_Daten!B241)","v":"Lang"},{"$f":"IF(ASV_Daten!C241=\"\",\"\",ASV_Daten!C241)","v":"Marianne"},{"$f":"IF(ASV_Daten!D241=\"\",\"\",ASV_Daten!D241)","v":2008},{"$f":"IF(ASV_Daten!E241=\"\",\"\",ASV_Daten!E241)","v":"w"},"7bw",13,"13w",null,null,null,null,null,null,null,null,null,null,false,"nix"]
[{"$f":"IF(ASV_Daten!A242=\"\",\"\",ASV_Daten!A242)","v":"7b"},{"$f":"IF(ASV_Daten!B242=\"\",\"\",ASV_Daten!B242)","v":"Strasser"},{"$f":"IF(ASV_Daten!C242=\"\",\"\",ASV_Daten!C242)","v":"Kurt"},{"$f":"IF(ASV_Daten!D242=\"\",\"\",ASV_Daten!D242)","v":2009},{"$f":"IF(ASV_Daten!E242=\"\",\"\",ASV_Daten!E242)","v":"m"},"7bm",12,"12m",null,null,null,null,null,null,null,null,null,null,false,"nix"]
[{"$f":"IF(ASV_Daten!A243=\"\",\"\",ASV_Daten!A243)","v":"7b"},{"$f":"IF(ASV_Daten!B243=\"\",\"\",ASV_Daten!B243)","v":"Reiter"},{"$f":"IF(ASV_Daten!C243=\"\",\"\",ASV_Daten!C243)","v":"Friedrich"},{"$f":"IF(ASV_Daten!D243=\"\",\"\",ASV_Daten!D243)","v":2009},{"$f":"IF(ASV_Daten!E243=\"\",\"\",ASV_Daten!E243)","v":"m"},"7bm",12,"12m",null,null,null,null,null,null,null,null,null,null,false,"nix"]
[{"$f":"IF(ASV_Daten!A244=\"\",\"\",ASV_Daten!A244)","v":"7b"},{"$f":"IF(ASV_Daten!B244=\"\",\"\",ASV_Daten!B244)","v":"Kellner"},{"$f":"IF(ASV_Daten!C244=\"\",\"\",ASV_Daten!C244)","v":"Susanne"},{"$f":"IF(ASV_Daten!D244=\"\",\"\",ASV_Daten!D244)","v":2009},{"$f":"IF(ASV_Daten!E244=\"\",\"\",ASV_Daten!E244)","v":"w"},"7bw",12,"12w",null,null,null,null,null,null,null,null,null,null,false,"nix"]
[{"$f":"IF(ASV_Daten!A245=\"\",\"\",ASV_Daten!A245)","v":"7b"},{"$f":"IF(ASV_Daten!B245=\"\",\"\",ASV_Daten!B245)","v":"Koch"},{"$f":"IF(ASV_Daten!C245=\"\",\"\",ASV_Daten!C245)","v":"Christine"},{"$f":"IF(ASV_Daten!D245=\"\",\"\",ASV_Daten!D245)","v":2009},{"$f":"IF(ASV_Daten!E245=\"\",\"\",ASV_Daten!E245)","v":"w"},"7bw",12,"12w",null,null,null,null,null,null,null,null,null,null,false,"nix"]
[{"$f":"IF(ASV_Daten!A246=\"\",\"\",ASV_Daten!A246)","v":"7b"},{"$f":"IF(ASV_Daten!B246=\"\",\"\",ASV_Daten!B246)","v":"Stein"},{"$f":"IF(ASV_Daten!C246=\"\",\"\",ASV_Daten!C246)","v":"Markus"},{"$f":"IF(ASV_Daten!D246=\"\",\"\",ASV_Daten!D246)","v":2009},{"$f":"IF(ASV_Daten!E246=\"\",\"\",ASV_Daten!E246)","v":"m"},"7bm",12,"12m",null,null,null,null,null,null,null,null,null,null,false,"nix"]
[{"$f":"IF(ASV_Daten!A247=\"\",\"\",ASV_Daten!A247)","v":"7b"},{"$f":"IF(ASV_Daten!B247=\"\",\"\",ASV_Daten!B247)","v":"Mayr"},{"$f":"IF(ASV_Daten!C247=\"\",\"\",ASV_Daten!C247)","v":"Sigrid"},{"$f":"IF(ASV_Daten!D247=\"\",\"\",ASV_Daten!D247)","v":2009},{"$f":"IF(ASV_Daten!E247=\"\",\"\",ASV_Daten!E247)","v":"w"},"7bw",12,"12w",null,null,null,null,null,null,null,null,null,null,false,"nix"]
[{"$f":"IF(ASV_Daten!A248=\"\",\"\",ASV_Daten!A248)","v":"7b"},{"$f":"IF(ASV_Daten!B248=\"\",\"\",ASV_Daten!B248)","v":"Lindner"},{"$f":"IF(ASV_Daten!C248=\"\",\"\",ASV_Daten!C248)","v":"Christian"},{"$f":"IF(ASV_Daten!D248=\"\",\"\",ASV_Daten!D248)","v":2008},{"$f":"IF(ASV_Daten!E248=\"\",\"\",ASV_Daten!E248)","v":"m"},"7bm",13,"13m",null,null,null,null,null,null,null,null,null,null,false,"nix"]
[{"$f":"IF(ASV_Daten!A249=\"\",\"\",ASV_Daten!A249)","v":"7b"},{"$f":"IF(ASV_Daten!B249=\"\",\"\",ASV_Daten!B249)","v":"Siener"},{"$f":"IF(ASV_Daten!C249=\"\",\"\",ASV_Daten!C249)","v":"Nadja"},{"$f":"IF(ASV_Daten!D249=\"\",\"\",ASV_Daten!D249)","v":2008},{"$f":"IF(ASV_Daten!E249=\"\",\"\",ASV_Daten!E249)","v":"w"},"7bw",13,"13w",null,null,null,null,null,null,null,null,null,null,false,"nix"]
[{"$f":"IF(ASV_Daten!A250=\"\",\"\",ASV_Daten!A250)","v":"7b"},{"$f":"IF(ASV_Daten!B250=\"\",\"\",ASV_Daten!B250)","v":"Lang"},{"$f":"IF(ASV_Daten!C250=\"\",\"\",ASV_Daten!C250)","v":"Marianne"},{"$f":"IF(ASV_Daten!D250=\"\",\"\",ASV_Daten!D250)","v":2008},{"$f":"IF(ASV_Daten!E250=\"\",\"\",ASV_Daten!E250)","v":"w"},"7bw",13,"13w",null,null,null,null,null,null,null,null,null,null,false,"nix"]
[{"$f":"IF(ASV_Daten!A251=\"\",\"\",ASV_Daten!A251)","v":"7b"},{"$f":"IF(ASV_Daten!B251=\"\",\"\",ASV_Daten!B251)","v":"Strasser"},{"$f":"IF(ASV_Daten!C251=\"\",\"\",ASV_Daten!C251)","v":"Kurt"},{"$f":"IF(ASV_Daten!D251=\"\",\"\",ASV_Daten!D251)","v":2009},{"$f":"IF(ASV_Daten!E251=\"\",\"\",ASV_Daten!E251)","v":"m"},"7bm",12,"12m",null,null,null,null,null,null,null,null,null,null,false,"nix"]
[{"$f":"IF(ASV_Daten!A252=\"\",\"\",ASV_Daten!A252)","v":"7b"},{"$f":"IF(ASV_Daten!B252=\"\",\"\",ASV_Daten!B252)","v":"Reiter"},{"$f":"IF(ASV_Daten!C252=\"\",\"\",ASV_Daten!C252)","v":"Friedrich"},{"$f":"IF(ASV_Daten!D252=\"\",\"\",ASV_Daten!D252)","v":2009},{"$f":"IF(ASV_Daten!E252=\"\",\"\",ASV_Daten!E252)","v":"m"},"7bm",12,"12m",null,null,null,null,null,null,null,null,null,null,false,"nix"]
[{"$f":"IF(ASV_Daten!A253=\"\",\"\",ASV_Daten!A253)","v":"7b"},{"$f":"IF(ASV_Daten!B253=\"\",\"\",ASV_Daten!B253)","v":"Kellner"},{"$f":"IF(ASV_Daten!C253=\"\",\"\",ASV_Daten!C253)","v":"Susanne"},{"$f":"IF(ASV_Daten!D253=\"\",\"\",ASV_Daten!D253)","v":2009},{"$f":"IF(ASV_Daten!E253=\"\",\"\",ASV_Daten!E253)","v":"w"},"7bw",12,"12w",null,null,null,null,null,null,null,null,null,null,false,"nix"]
[{"$f":"IF(ASV_Daten!A254=\"\",\"\",ASV_Daten!A254)","v":"7b"},{"$f":"IF(ASV_Daten!B254=\"\",\"\",ASV_Daten!B254)","v":"Koch"},{"$f":"IF(ASV_Daten!C254=\"\",\"\",ASV_Daten!C254)","v":"Christine"},{"$f":"IF(ASV_Daten!D254=\"\",\"\",ASV_Daten!D254)","v":2009},{"$f":"IF(ASV_Daten!E254=\"\",\"\",ASV_Daten!E254)","v":"w"},"7bw",12,"12w",null,null,null,null,null,null,null,null,null,null,false,"nix"]
[{"$f":"IF(ASV_Daten!A255=\"\",\"\",ASV_Daten!A255)","v":"7b"},{"$f":"IF(ASV_Daten!B255=\"\",\"\",ASV_Daten!B255)","v":"Stein"},{"$f":"IF(ASV_Daten!C255=\"\",\"\",ASV_Daten!C255)","v":"Markus"},{"$f":"IF(ASV_Daten!D255=\"\",\"\",ASV_Daten!D255)","v":2009},{"$f":"IF(ASV_Daten!E255=\"\",\"\",ASV_Daten!E255)","v":"m"},"7bm",12,"12m",null,null,null,null,null,null,null,null,null,null,false,"nix"]
[{"$f":"IF(ASV_Daten!A256=\"\",\"\",ASV_Daten!A256)","v":"7b"},{"$f":"IF(ASV_Daten!B256=\"\",\"\",ASV_Daten!B256)","v":"Mayr"},{"$f":"IF(ASV_Daten!C256=\"\",\"\",ASV_Daten!C256)","v":"Sigrid"},{"$f":"IF(ASV_Daten!D256=\"\",\"\",ASV_Daten!D256)","v":2009},{"$f":"IF(ASV_Daten!E256=\"\",\"\",ASV_Daten!E256)","v":"w"},"7bw",12,"12w",null,null,null,null,null,null,null,null,null,null,false,"nix"]
[{"$f":"IF(ASV_Daten!A257=\"\",\"\",ASV_Daten!A257)","v":"7b"},{"$f":"IF(ASV_Daten!B257=\"\",\"\",ASV_Daten!B257)","v":"Lindner"},{"$f":"IF(ASV_Daten!C257=\"\",\"\",ASV_Daten!C257)","v":"Christian"},{"$f":"IF(ASV_Daten!D257=\"\",\"\",ASV_Daten!D257)","v":2008},{"$f":"IF(ASV_Daten!E257=\"\",\"\",ASV_Daten!E257)","v":"m"},"7bm",13,"13m",null,null,null,null,null,null,null,null,null,null,false,"nix"]
[{"$f":"IF(ASV_Daten!A258=\"\",\"\",ASV_Daten!A258)","v":"7b"},{"$f":"IF(ASV_Daten!B258=\"\",\"\",ASV_Daten!B258)","v":"Siener"},{"$f":"IF(ASV_Daten!C258=\"\",\"\",ASV_Daten!C258)","v":"Nadja"},{"$f":"IF(ASV_Daten!D258=\"\",\"\",ASV_Daten!D258)","v":2008},{"$f":"IF(ASV_Daten!E258=\"\",\"\",ASV_Daten!E258)","v":"w"},"7bw",13,"13w",null,null,null,null,null,null,null,null,null,null,false,"nix"]
[{"$f":"IF(ASV_Daten!A259=\"\",\"\",ASV_Daten!A259)","v":"7b"},{"$f":"IF(ASV_Daten!B259=\"\",\"\",ASV_Daten!B259)","v":"Lang"},{"$f":"IF(ASV_Daten!C259=\"\",\"\",ASV_Daten!C259)","v":"Marianne"},{"$f":"IF(ASV_Daten!D259=\"\",\"\",ASV_Daten!D259)","v":2008},{"$f":"IF(ASV_Daten!E259=\"\",\"\",ASV_Daten!E259)","v":"w"},"7bw",13,"13w",null,null,null,null,null,null,null,null,null,null,false,"nix"]
[{"$f":"IF(ASV_Daten!A260=\"\",\"\",ASV_Daten!A260)","v":"7b"},{"$f":"IF(ASV_Daten!B260=\"\",\"\",ASV_Daten!B260)","v":"Strasser"},{"$f":"IF(ASV_Daten!C260=\"\",\"\",ASV_Daten!C260)","v":"Kurt"},{"$f":"IF(ASV_Daten!D260=\"\",\"\",ASV_Daten!D260)","v":2009},{"$f":"IF(ASV_Daten!E260=\"\",\"\",ASV_Daten!E260)","v":"m"},"7bm",12,"12m",null,null,null,null,null,null,null,null,null,null,false,"nix"]
[{"$f":"IF(ASV_Daten!A261=\"\",\"\",ASV_Daten!A261)","v":"7b"},{"$f":"IF(ASV_Daten!B261=\"\",\"\",ASV_Daten!B261)","v":"Reiter"},{"$f":"IF(ASV_Daten!C261=\"\",\"\",ASV_Daten!C261)","v":"Friedrich"},{"$f":"IF(ASV_Daten!D261=\"\",\"\",ASV_Daten!D261)","v":2009},{"$f":"IF(ASV_Daten!E261=\"\",\"\",ASV_Daten!E261)","v":"m"},"7bm",12,"12m",null,null,null,null,null,null,null,null,null,null,false,"nix"]
[{"$f":"IF(ASV_Daten!A262=\"\",\"\",ASV_Daten!A262)","v":"7b"},{"$f":"IF(ASV_Daten!B262=\"\",\"\",ASV_Daten!B262)","v":"Kellner"},{"$f":"IF(ASV_Daten!C262=\"\",\"\",ASV_Daten!C262)","v":"Susanne"},{"$f":"IF(ASV_Daten!D262=\"\",\"\",ASV_Daten!D262)","v":2009},{"$f":"IF(ASV_Daten!E262=\"\",\"\",ASV_Daten!E262)","v":"w"},"7bw",12,"12w",null,null,null,null,null,null,null,null,null,null,false,"nix"]
[{"$f":"IF(ASV_Daten!A263=\"\",\"\",ASV_Daten!A263)","v":"7b"},{"$f":"IF(ASV_Daten!B263=\"\",\"\",ASV_Daten!B263)","v":"Koch"},{"$f":"IF(ASV_Daten!C263=\"\",\"\",ASV_Daten!C263)","v":"Christine"},{"$f":"IF(ASV_Daten!D263=\"\",\"\",ASV_Daten!D263)","v":2009},{"$f":"IF(ASV_Daten!E263=\"\",\"\",ASV_Daten!E263)","v":"w"},"7bw",12,"12w",null,null,null,null,null,null,null,null,null,null,false,"nix"]
[{"$f":"IF(ASV_Daten!A264=\"\",\"\",ASV_Daten!A264)","v":"7b"},{"$f":"IF(ASV_Daten!B264=\"\",\"\",ASV_Daten!B264)","v":"Stein"},{"$f":"IF(ASV_Daten!C264=\"\",\"\",ASV_Daten!C264)","v":"Markus"},{"$f":"IF(ASV_Daten!D264=\"\",\"\",ASV_Daten!D264)","v":2009},{"$f":"IF(ASV_Daten!E264=\"\",\"\",ASV_Daten!E264)","v":"m"},"7bm",12,"12m",null,null,null,null,null,null,null,null,null,null,false,"nix"]
[{"$f":"IF(ASV_Daten!A265=\"\",\"\",ASV_Daten!A265)","v":"7b"},{"$f":"IF(ASV_Daten!B265=\"\",\"\",ASV_Daten!B265)","v":"Mayr"},{"$f":"IF(ASV_Daten!C265=\"\",\"\",ASV_Daten!C265)","v":"Sigrid"},{"$f":"IF(ASV_Daten!D265=\"\",\"\",ASV_Daten!D265)","v":2009},{"$f":"IF(ASV_Daten!E265=\"\",\"\",ASV_Daten!E265)","v":"w"},"7bw",12,"12w",null,null,null,null,null,null,null,null,null,null,false,"nix"]
[{"$f":"IF(ASV_Daten!A266=\"\",\"\",ASV_Daten!A266)","v":"7c"},{"$f":"IF(ASV_Daten!B266=\"\",\"\",ASV_Daten!B266)","v":"Schwarz"},{"$f":"IF(ASV_Daten!C266=\"\",\"\",ASV_Daten!C266)","v":"Daniel"},{"$f":"IF(ASV_Daten!D266=\"\",\"\",ASV_Daten!D266)","v":2009},{"$f":"IF(ASV_Daten!E266=\"\",\"\",ASV_Daten!E266)","v":"m"},"7cm",12,"12m",null,null,null,null,null,null,null,null,null,null,false,"nix"]
[{"$f":"IF(ASV_Daten!A267=\"\",\"\",ASV_Daten!A267)","v":"7c"},{"$f":"IF(ASV_Daten!B267=\"\",\"\",ASV_Daten!B267)","v":"Hauser"},{"$f":"IF(ASV_Daten!C267=\"\",\"\",ASV_Daten!C267)","v":"Hans"},{"$f":"IF(ASV_Daten!D267=\"\",\"\",ASV_Daten!D267)","v":2008},{"$f":"IF(ASV_Daten!E267=\"\",\"\",ASV_Daten!E267)","v":"m"},"7cm",13,"13m",null,null,null,null,null,null,null,null,null,null,false,"nix"]
[{"$f":"IF(ASV_Daten!A268=\"\",\"\",ASV_Daten!A268)","v":"7c"},{"$f":"IF(ASV_Daten!B268=\"\",\"\",ASV_Daten!B268)","v":"Gruber"},{"$f":"IF(ASV_Daten!C268=\"\",\"\",ASV_Daten!C268)","v":"Manfred"},{"$f":"IF(ASV_Daten!D268=\"\",\"\",ASV_Daten!D268)","v":2008},{"$f":"IF(ASV_Daten!E268=\"\",\"\",ASV_Daten!E268)","v":"m"},"7cm",13,"13m",null,null,null,null,null,null,null,null,null,null,false,"nix"]
[{"$f":"IF(ASV_Daten!A269=\"\",\"\",ASV_Daten!A269)","v":"7c"},{"$f":"IF(ASV_Daten!B269=\"\",\"\",ASV_Daten!B269)","v":"wagner"},{"$f":"IF(ASV_Daten!C269=\"\",\"\",ASV_Daten!C269)","v":"Eva"},{"$f":"IF(ASV_Daten!D269=\"\",\"\",ASV_Daten!D269)","v":2008},{"$f":"IF(ASV_Daten!E269=\"\",\"\",ASV_Daten!E269)","v":"w"},"7cw",13,"13w",null,null,null,null,null,null,null,null,null,null,false,"nix"]
[{"$f":"IF(ASV_Daten!A270=\"\",\"\",ASV_Daten!A270)","v":"7c"},{"$f":"IF(ASV_Daten!B270=\"\",\"\",ASV_Daten!B270)","v":"Böck"},{"$f":"IF(ASV_Daten!C270=\"\",\"\",ASV_Daten!C270)","v":"Veronika"},{"$f":"IF(ASV_Daten!D270=\"\",\"\",ASV_Daten!D270)","v":2008},{"$f":"IF(ASV_Daten!E270=\"\",\"\",ASV_Daten!E270)","v":"w"},"7cw",13,"13w",null,null,null,null,null,null,null,null,null,null,false,"nix"]
[{"$f":"IF(ASV_Daten!A271=\"\",\"\",ASV_Daten!A271)","v":"7c"},{"$f":"IF(ASV_Daten!B271=\"\",\"\",ASV_Daten!B271)","v":"Freiberg"},{"$f":"IF(ASV_Daten!C271=\"\",\"\",ASV_Daten!C271)","v":"Sigrid"},{"$f":"IF(ASV_Daten!D271=\"\",\"\",ASV_Daten!D271)","v":2008},{"$f":"IF(ASV_Daten!E271=\"\",\"\",ASV_Daten!E271)","v":"w"},"7cw",13,"13w",null,null,null,null,null,null,null,null,null,null,false,"nix"]
[{"$f":"IF(ASV_Daten!A272=\"\",\"\",ASV_Daten!A272)","v":"7c"},{"$f":"IF(ASV_Daten!B272=\"\",\"\",ASV_Daten!B272)","v":"Lustig"},{"$f":"IF(ASV_Daten!C272=\"\",\"\",ASV_Daten!C272)","v":"Maria"},{"$f":"IF(ASV_Daten!D272=\"\",\"\",ASV_Daten!D272)","v":2008},{"$f":"IF(ASV_Daten!E272=\"\",\"\",ASV_Daten!E272)","v":"w"},"7cw",13,"13w",null,null,null,null,null,null,null,null,null,null,false,"nix"]
[{"$f":"IF(ASV_Daten!A273=\"\",\"\",ASV_Daten!A273)","v":"7c"},{"$f":"IF(ASV_Daten!B273=\"\",\"\",ASV_Daten!B273)","v":"Freud"},{"$f":"IF(ASV_Daten!C273=\"\",\"\",ASV_Daten!C273)","v":"Sebastian"},{"$f":"IF(ASV_Daten!D273=\"\",\"\",ASV_Daten!D273)","v":2008},{"$f":"IF(ASV_Daten!E273=\"\",\"\",ASV_Daten!E273)","v":"m"},"7cm",13,"13m",null,null,null,null,null,null,null,null,null,null,false,"nix"]
[{"$f":"IF(ASV_Daten!A274=\"\",\"\",ASV_Daten!A274)","v":"7c"},{"$f":"IF(ASV_Daten!B274=\"\",\"\",ASV_Daten!B274)","v":"Schwarz"},{"$f":"IF(ASV_Daten!C274=\"\",\"\",ASV_Daten!C274)","v":"Daniel"},{"$f":"IF(ASV_Daten!D274=\"\",\"\",ASV_Daten!D274)","v":2009},{"$f":"IF(ASV_Daten!E274=\"\",\"\",ASV_Daten!E274)","v":"m"},"7cm",12,"12m",null,null,null,null,null,null,null,null,null,null,false,"nix"]
[{"$f":"IF(ASV_Daten!A275=\"\",\"\",ASV_Daten!A275)","v":"7c"},{"$f":"IF(ASV_Daten!B275=\"\",\"\",ASV_Daten!B275)","v":"Hauser"},{"$f":"IF(ASV_Daten!C275=\"\",\"\",ASV_Daten!C275)","v":"Hans"},{"$f":"IF(ASV_Daten!D275=\"\",\"\",ASV_Daten!D275)","v":2008},{"$f":"IF(ASV_Daten!E275=\"\",\"\",ASV_Daten!E275)","v":"m"},"7cm",13,"13m",null,null,null,null,null,null,null,null,null,null,false,"nix"]
[{"$f":"IF(ASV_Daten!A276=\"\",\"\",ASV_Daten!A276)","v":"7c"},{"$f":"IF(ASV_Daten!B276=\"\",\"\",ASV_Daten!B276)","v":"Gruber"},{"$f":"IF(ASV_Daten!C276=\"\",\"\",ASV_Daten!C276)","v":"Manfred"},{"$f":"IF(ASV_Daten!D276=\"\",\"\",ASV_Daten!D276)","v":2008},{"$f":"IF(ASV_Daten!E276=\"\",\"\",ASV_Daten!E276)","v":"m"},"7cm",13,"13m",null,null,null,null,null,null,null,null,null,null,{"$f":"IF(AND(A277=\"1a\",E277=\"m\"),\"N1m\",IF(AND(A277=\"1a\",E277=\"w\"),\"N1w\",IF(AND(A277=\"1b\",E277=\"w\"),\"N1w\",IF(AND(A277=\"1b\",E277=\"m\"),\"N1m\",IF(AND(A277=\"2a\",E277=\"m\"),\"N2m\",IF(AND(A277=\"2a\",E277=\"w\"),\"N2w\",IF(AND(A277=\"2b\",E277=\"w\"),\"N2w\",IF(AND(A277=\"2b\",E277=\"m\"),\"N2m\",IF(AND(A277=\"3a\",E277=\"m\"),\"N3m\",IF(AND(A277=\"3a\",E277=\"w\"),\"N3w\",IF(AND(A277=\"3b\",E277=\"w\"),\"N3w\",IF(AND(A277=\"3b\",E277=\"m\"),\"N3m\",IF(AND(A277=\"4a\",E277=\"m\"),\"N4m\",IF(AND(A277=\"4a\",E277=\"w\"),\"N4w\",IF(AND(A277=\"4b\",E277=\"m\"),\"N4m\",IF(AND(A277=\"4b\",E277=\"w\"),\"N4w\"))))))))))))))))","v":false},{"$f":"IF(S277=\"n1m\",VLOOKUP(Q277,N1m,2),IF(S277=\"N1w\",VLOOKUP(Q277,N1w,2),IF(S277=\"N2m\",VLOOKUP(Q277,n2m,2),IF(S277=\"N2w\",VLOOKUP(Q277,n2w,2),IF(S277=\"N3w\",VLOOKUP(Q277,n3w,2),IF(S277=\"N3m\",VLOOKUP(Q277,n3m,2),IF(S277=\"N4w\",VLOOKUP(Q277,n4w,2),IF(S277=\"N4m\",VLOOKUP(Q277,n4m,2),\"nix\"))))))))","v":"nix"}]
[{"$f":"IF(ASV_Daten!A277=\"\",\"\",ASV_Daten!A277)","v":"7c"},{"$f":"IF(ASV_Daten!B277=\"\",\"\",ASV_Daten!B277)","v":"wagner"},{"$f":"IF(ASV_Daten!C277=\"\",\"\",ASV_Daten!C277)","v":"Eva"},{"$f":"IF(ASV_Daten!D277=\"\",\"\",ASV_Daten!D277)","v":2008},{"$f":"IF(ASV_Daten!E277=\"\",\"\",ASV_Daten!E277)","v":"w"},"7cw",13,"13w",null,null,null,null,null,null,null,null,null,null,false,"nix"]
[{"$f":"IF(ASV_Daten!A278=\"\",\"\",ASV_Daten!A278)","v":"7c"},{"$f":"IF(ASV_Daten!B278=\"\",\"\",ASV_Daten!B278)","v":"Böck"},{"$f":"IF(ASV_Daten!C278=\"\",\"\",ASV_Daten!C278)","v":"Veronika"},{"$f":"IF(ASV_Daten!D278=\"\",\"\",ASV_Daten!D278)","v":2008},{"$f":"IF(ASV_Daten!E278=\"\",\"\",ASV_Daten!E278)","v":"w"},"7cw",13,"13w",null,null,null,null,null,null,null,null,null,null,false,"nix"]
[{"$f":"IF(ASV_Daten!A279=\"\",\"\",ASV_Daten!A279)","v":"7c"},{"$f":"IF(ASV_Daten!B279=\"\",\"\",ASV_Daten!B279)","v":"Freiberg"},{"$f":"IF(ASV_Daten!C279=\"\",\"\",ASV_Daten!C279)","v":"Sigrid"},{"$f":"IF(ASV_Daten!D279=\"\",\"\",ASV_Daten!D279)","v":2008},{"$f":"IF(ASV_Daten!E279=\"\",\"\",ASV_Daten!E279)","v":"w"},{"$f":"A280&E280","v":"7cw"},{"$f":"IF(D280=\"\",\"\",$B$1-$D280)","v":13},{"$f":"G280&E280","v":"13w"},null,null,null,null,null,null,null,null,null,null,false,"nix"]
[{"$f":"IF(ASV_Daten!A280=\"\",\"\",ASV_Daten!A280)","v":"7c"},{"$f":"IF(ASV_Daten!B280=\"\",\"\",ASV_Daten!B280)","v":"Lustig"},{"$f":"IF(ASV_Daten!C280=\"\",\"\",ASV_Daten!C280)","v":"Maria"},{"$f":"IF(ASV_Daten!D280=\"\",\"\",ASV_Daten!D280)","v":2008},{"$f":"IF(ASV_Daten!E280=\"\",\"\",ASV_Daten!E280)","v":"w"},"7cw",13,"13w",null,null,null,null,null,null,null,null,null,null,false,"nix"]
[{"$f":"IF(ASV_Daten!A281=\"\",\"\",ASV_Daten!A281)","v":"7c"},{"$f":"IF(ASV_Daten!B281=\"\",\"\",ASV_Daten!B281)","v":"Freud"},{"$f":"IF(ASV_Daten!C281=\"\",\"\",ASV_Daten!C281)","v":"Sebastian"},{"$f":"IF(ASV_Daten!D281=\"\",\"\",ASV_Daten!D281)","v":2008},{"$f":"IF(ASV_Daten!E281=\"\",\"\",ASV_Daten!E281)","v":"m"},"7cm",13,"13m",null,null,null,null,null,null,null,null,null,null,false,"nix"]
[{"$f":"IF(ASV_Daten!A282=\"\",\"\",ASV_Daten!A282)","v":"7c"},{"$f":"IF(ASV_Daten!B282=\"\",\"\",ASV_Daten!B282)","v":"Schwarz"},{"$f":"IF(ASV_Daten!C282=\"\",\"\",ASV_Daten!C282)","v":"Daniel"},{"$f":"IF(ASV_Daten!D282=\"\",\"\",ASV_Daten!D282)","v":2009},{"$f":"IF(ASV_Daten!E282=\"\",\"\",ASV_Daten!E282)","v":"m"},"7cm",12,"12m",null,null,null,null,null,null,null,null,null,null,false,"nix"]
[{"$f":"IF(ASV_Daten!A283=\"\",\"\",ASV_Daten!A283)","v":"7c"},{"$f":"IF(ASV_Daten!B283=\"\",\"\",ASV_Daten!B283)","v":"Hauser"},{"$f":"IF(ASV_Daten!C283=\"\",\"\",ASV_Daten!C283)","v":"Hans"},{"$f":"IF(ASV_Daten!D283=\"\",\"\",ASV_Daten!D283)","v":2008},{"$f":"IF(ASV_Daten!E283=\"\",\"\",ASV_Daten!E283)","v":"m"},"7cm",13,"13m",null,null,null,null,null,null,null,null,null,null,false,"nix"]
[{"$f":"IF(ASV_Daten!A284=\"\",\"\",ASV_Daten!A284)","v":"7c"},{"$f":"IF(ASV_Daten!B284=\"\",\"\",ASV_Daten!B284)","v":"Gruber"},{"$f":"IF(ASV_Daten!C284=\"\",\"\",ASV_Daten!C284)","v":"Manfred"},{"$f":"IF(ASV_Daten!D284=\"\",\"\",ASV_Daten!D284)","v":2008},{"$f":"IF(ASV_Daten!E284=\"\",\"\",ASV_Daten!E284)","v":"m"},"7cm",13,"13m",null,null,null,null,null,null,null,null,null,null,false,"nix"]
[{"$f":"IF(ASV_Daten!A285=\"\",\"\",ASV_Daten!A285)","v":"7c"},{"$f":"IF(ASV_Daten!B285=\"\",\"\",ASV_Daten!B285)","v":"wagner"},{"$f":"IF(ASV_Daten!C285=\"\",\"\",ASV_Daten!C285)","v":"Eva"},{"$f":"IF(ASV_Daten!D285=\"\",\"\",ASV_Daten!D285)","v":2008},{"$f":"IF(ASV_Daten!E285=\"\",\"\",ASV_Daten!E285)","v":"w"},"7cw",13,"13w",null,null,null,null,null,null,null,null,null,null,false,"nix"]
[{"$f":"IF(ASV_Daten!A286=\"\",\"\",ASV_Daten!A286)","v":"7c"},{"$f":"IF(ASV_Daten!B286=\"\",\"\",ASV_Daten!B286)","v":"Böck"},{"$f":"IF(ASV_Daten!C286=\"\",\"\",ASV_Daten!C286)","v":"Veronika"},{"$f":"IF(ASV_Daten!D286=\"\",\"\",ASV_Daten!D286)","v":2008},{"$f":"IF(ASV_Daten!E286=\"\",\"\",ASV_Daten!E286)","v":"w"},"7cw",13,"13w",null,null,null,null,null,null,null,null,null,null,false,"nix"]
[{"$f":"IF(ASV_Daten!A287=\"\",\"\",ASV_Daten!A287)","v":"7c"},{"$f":"IF(ASV_Daten!B287=\"\",\"\",ASV_Daten!B287)","v":"Freiberg"},{"$f":"IF(ASV_Daten!C287=\"\",\"\",ASV_Daten!C287)","v":"Sigrid"},{"$f":"IF(ASV_Daten!D287=\"\",\"\",ASV_Daten!D287)","v":2008},{"$f":"IF(ASV_Daten!E287=\"\",\"\",ASV_Daten!E287)","v":"w"},"7cw",13,"13w",null,null,null,null,null,null,null,null,null,null,false,"nix"]
[{"$f":"IF(ASV_Daten!A288=\"\",\"\",ASV_Daten!A288)","v":"7c"},{"$f":"IF(ASV_Daten!B288=\"\",\"\",ASV_Daten!B288)","v":"Lustig"},{"$f":"IF(ASV_Daten!C288=\"\",\"\",ASV_Daten!C288)","v":"Maria"},{"$f":"IF(ASV_Daten!D288=\"\",\"\",ASV_Daten!D288)","v":2008},{"$f":"IF(ASV_Daten!E288=\"\",\"\",ASV_Daten!E288)","v":"w"},"7cw",13,"13w",null,null,null,null,null,null,null,null,null,null,false,"nix"]
[{"$f":"IF(ASV_Daten!A289=\"\",\"\",ASV_Daten!A289)","v":"7c"},{"$f":"IF(ASV_Daten!B289=\"\",\"\",ASV_Daten!B289)","v":"Freud"},{"$f":"IF(ASV_Daten!C289=\"\",\"\",ASV_Daten!C289)","v":"Sebastian"},{"$f":"IF(ASV_Daten!D289=\"\",\"\",ASV_Daten!D289)","v":2008},{"$f":"IF(ASV_Daten!E289=\"\",\"\",ASV_Daten!E289)","v":"m"},"7cm",13,"13m",null,null,null,null,null,null,null,null,null,null,false,"nix"]
[{"$f":"IF(ASV_Daten!A290=\"\",\"\",ASV_Daten!A290)","v":"7d"},{"$f":"IF(ASV_Daten!B290=\"\",\"\",ASV_Daten!B290)","v":"Branniger"},{"$f":"IF(ASV_Daten!C290=\"\",\"\",ASV_Daten!C290)","v":"Clarissa"},{"$f":"IF(ASV_Daten!D290=\"\",\"\",ASV_Daten!D290)","v":2008},{"$f":"IF(ASV_Daten!E290=\"\",\"\",ASV_Daten!E290)","v":"w"},"7dw",13,"13w",null,null,null,null,null,null,null,null,null,null,false,"nix"]
[{"$f":"IF(ASV_Daten!A291=\"\",\"\",ASV_Daten!A291)","v":"7d"},{"$f":"IF(ASV_Daten!B291=\"\",\"\",ASV_Daten!B291)","v":"Birkus"},{"$f":"IF(ASV_Daten!C291=\"\",\"\",ASV_Daten!C291)","v":"Yvo"},{"$f":"IF(ASV_Daten!D291=\"\",\"\",ASV_Daten!D291)","v":2008},{"$f":"IF(ASV_Daten!E291=\"\",\"\",ASV_Daten!E291)","v":"w"},"7dw",13,"13w",null,null,null,null,null,null,null,null,null,null,false,"nix"]
[{"$f":"IF(ASV_Daten!A292=\"\",\"\",ASV_Daten!A292)","v":"7d"},{"$f":"IF(ASV_Daten!B292=\"\",\"\",ASV_Daten!B292)","v":"wlodomar"},{"$f":"IF(ASV_Daten!C292=\"\",\"\",ASV_Daten!C292)","v":"Hermann"},{"$f":"IF(ASV_Daten!D292=\"\",\"\",ASV_Daten!D292)","v":2008},{"$f":"IF(ASV_Daten!E292=\"\",\"\",ASV_Daten!E292)","v":"m"},"7dm",13,"13m",null,null,null,null,null,null,null,null,null,null,false,"nix"]
[{"$f":"IF(ASV_Daten!A293=\"\",\"\",ASV_Daten!A293)","v":"7d"},{"$f":"IF(ASV_Daten!B293=\"\",\"\",ASV_Daten!B293)","v":"Armbrecht"},{"$f":"IF(ASV_Daten!C293=\"\",\"\",ASV_Daten!C293)","v":"Mark"},{"$f":"IF(ASV_Daten!D293=\"\",\"\",ASV_Daten!D293)","v":2008},{"$f":"IF(ASV_Daten!E293=\"\",\"\",ASV_Daten!E293)","v":"m"},"7dm",13,"13m",null,null,null,null,null,null,null,null,null,null,false,"nix"]
[{"$f":"IF(ASV_Daten!A294=\"\",\"\",ASV_Daten!A294)","v":"7d"},{"$f":"IF(ASV_Daten!B294=\"\",\"\",ASV_Daten!B294)","v":"Adler"},{"$f":"IF(ASV_Daten!C294=\"\",\"\",ASV_Daten!C294)","v":"Marja"},{"$f":"IF(ASV_Daten!D294=\"\",\"\",ASV_Daten!D294)","v":2009},{"$f":"IF(ASV_Daten!E294=\"\",\"\",ASV_Daten!E294)","v":"w"},"7dw",12,"12w",null,null,null,null,null,null,null,null,null,null,false,"nix"]
[{"$f":"IF(ASV_Daten!A295=\"\",\"\",ASV_Daten!A295)","v":"7d"},{"$f":"IF(ASV_Daten!B295=\"\",\"\",ASV_Daten!B295)","v":"Pretlow"},{"$f":"IF(ASV_Daten!C295=\"\",\"\",ASV_Daten!C295)","v":"Janus"},{"$f":"IF(ASV_Daten!D295=\"\",\"\",ASV_Daten!D295)","v":2009},{"$f":"IF(ASV_Daten!E295=\"\",\"\",ASV_Daten!E295)","v":"m"},"7dm",12,"12m",null,null,null,null,null,null,null,null,null,null,false,"nix"]
[{"$f":"IF(ASV_Daten!A296=\"\",\"\",ASV_Daten!A296)","v":"7d"},{"$f":"IF(ASV_Daten!B296=\"\",\"\",ASV_Daten!B296)","v":"webel"},{"$f":"IF(ASV_Daten!C296=\"\",\"\",ASV_Daten!C296)","v":"Manfred"},{"$f":"IF(ASV_Daten!D296=\"\",\"\",ASV_Daten!D296)","v":2009},{"$f":"IF(ASV_Daten!E296=\"\",\"\",ASV_Daten!E296)","v":"m"},"7dm",12,"12m",null,null,null,null,null,null,null,null,null,null,false,"nix"]
[{"$f":"IF(ASV_Daten!A297=\"\",\"\",ASV_Daten!A297)","v":"7d"},{"$f":"IF(ASV_Daten!B297=\"\",\"\",ASV_Daten!B297)","v":"Dröfborn"},{"$f":"IF(ASV_Daten!C297=\"\",\"\",ASV_Daten!C297)","v":"Marik"},{"$f":"IF(ASV_Daten!D297=\"\",\"\",ASV_Daten!D297)","v":2009},{"$f":"IF(ASV_Daten!E297=\"\",\"\",ASV_Daten!E297)","v":"m"},"7dm",12,"12m",null,null,null,null,null,null,null,null,null,null,false,"nix"]
[{"$f":"IF(ASV_Daten!A298=\"\",\"\",ASV_Daten!A298)","v":"7d"},{"$f":"IF(ASV_Daten!B298=\"\",\"\",ASV_Daten!B298)","v":"Dziabu"},{"$f":"IF(ASV_Daten!C298=\"\",\"\",ASV_Daten!C298)","v":"Üsgül"},{"$f":"IF(ASV_Daten!D298=\"\",\"\",ASV_Daten!D298)","v":2009},{"$f":"IF(ASV_Daten!E298=\"\",\"\",ASV_Daten!E298)","v":"w"},"7dw",12,"12w",null,null,null,null,null,null,null,null,null,null,false,"nix"]
[{"$f":"IF(ASV_Daten!A299=\"\",\"\",ASV_Daten!A299)","v":"7d"},{"$f":"IF(ASV_Daten!B299=\"\",\"\",ASV_Daten!B299)","v":"Branniger"},{"$f":"IF(ASV_Daten!C299=\"\",\"\",ASV_Daten!C299)","v":"Clarissa"},{"$f":"IF(ASV_Daten!D299=\"\",\"\",ASV_Daten!D299)","v":2008},{"$f":"IF(ASV_Daten!E299=\"\",\"\",ASV_Daten!E299)","v":"w"},"7dw",13,"13w",null,null,null,null,null,null,null,null,null,null,false,"nix"]
[{"$f":"IF(ASV_Daten!A300=\"\",\"\",ASV_Daten!A300)","v":"7d"},{"$f":"IF(ASV_Daten!B300=\"\",\"\",ASV_Daten!B300)","v":"Birkus"},{"$f":"IF(ASV_Daten!C300=\"\",\"\",ASV_Daten!C300)","v":"Yvo"},{"$f":"IF(ASV_Daten!D300=\"\",\"\",ASV_Daten!D300)","v":2008},{"$f":"IF(ASV_Daten!E300=\"\",\"\",ASV_Daten!E300)","v":"w"},"7dw",13,"13w",null,null,null,null,null,null,null,null,null,null,false,"nix"]
[{"$f":"IF(ASV_Daten!A301=\"\",\"\",ASV_Daten!A301)","v":"7d"},{"$f":"IF(ASV_Daten!B301=\"\",\"\",ASV_Daten!B301)","v":"wlodomar"},{"$f":"IF(ASV_Daten!C301=\"\",\"\",ASV_Daten!C301)","v":"Hermann"},{"$f":"IF(ASV_Daten!D301=\"\",\"\",ASV_Daten!D301)","v":2008},{"$f":"IF(ASV_Daten!E301=\"\",\"\",ASV_Daten!E301)","v":"m"},"7dm",13,"13m",null,null,null,null,null,null,null,null,null,null,false,"nix"]
[{"$f":"IF(ASV_Daten!A302=\"\",\"\",ASV_Daten!A302)","v":"7d"},{"$f":"IF(ASV_Daten!B302=\"\",\"\",ASV_Daten!B302)","v":"Armbrecht"},{"$f":"IF(ASV_Daten!C302=\"\",\"\",ASV_Daten!C302)","v":"Mark"},{"$f":"IF(ASV_Daten!D302=\"\",\"\",ASV_Daten!D302)","v":2008},{"$f":"IF(ASV_Daten!E302=\"\",\"\",ASV_Daten!E302)","v":"m"},"7dm",13,"13m",null,null,null,null,null,null,null,null,null,null,false,"nix"]
[{"$f":"IF(ASV_Daten!A303=\"\",\"\",ASV_Daten!A303)","v":"7d"},{"$f":"IF(ASV_Daten!B303=\"\",\"\",ASV_Daten!B303)","v":"Adler"},{"$f":"IF(ASV_Daten!C303=\"\",\"\",ASV_Daten!C303)","v":"Marja"},{"$f":"IF(ASV_Daten!D303=\"\",\"\",ASV_Daten!D303)","v":2009},{"$f":"IF(ASV_Daten!E303=\"\",\"\",ASV_Daten!E303)","v":"w"},"7dw",12,"12w",null,null,null,null,null,null,null,null,null,null,false,"nix"]
[{"$f":"IF(ASV_Daten!A304=\"\",\"\",ASV_Daten!A304)","v":"7d"},{"$f":"IF(ASV_Daten!B304=\"\",\"\",ASV_Daten!B304)","v":"Pretlow"},{"$f":"IF(ASV_Daten!C304=\"\",\"\",ASV_Daten!C304)","v":"Janus"},{"$f":"IF(ASV_Daten!D304=\"\",\"\",ASV_Daten!D304)","v":2009},{"$f":"IF(ASV_Daten!E304=\"\",\"\",ASV_Daten!E304)","v":"m"},"7dm",12,"12m",null,null,null,null,null,null,null,null,null,null,false,"nix"]
[{"$f":"IF(ASV_Daten!A305=\"\",\"\",ASV_Daten!A305)","v":"7d"},{"$f":"IF(ASV_Daten!B305=\"\",\"\",ASV_Daten!B305)","v":"webel"},{"$f":"IF(ASV_Daten!C305=\"\",\"\",ASV_Daten!C305)","v":"Manfred"},{"$f":"IF(ASV_Daten!D305=\"\",\"\",ASV_Daten!D305)","v":2009},{"$f":"IF(ASV_Daten!E305=\"\",\"\",ASV_Daten!E305)","v":"m"},"7dm",12,"12m",null,null,null,null,null,null,null,null,null,null,false,"nix"]
[{"$f":"IF(ASV_Daten!A306=\"\",\"\",ASV_Daten!A306)","v":"7d"},{"$f":"IF(ASV_Daten!B306=\"\",\"\",ASV_Daten!B306)","v":"Dröfborn"},{"$f":"IF(ASV_Daten!C306=\"\",\"\",ASV_Daten!C306)","v":"Marik"},{"$f":"IF(ASV_Daten!D306=\"\",\"\",ASV_Daten!D306)","v":2009},{"$f":"IF(ASV_Daten!E306=\"\",\"\",ASV_Daten!E306)","v":"m"},"7dm",12,"12m",null,null,null,null,null,null,null,null,null,null,false,"nix"]
[{"$f":"IF(ASV_Daten!A307=\"\",\"\",ASV_Daten!A307)","v":"7d"},{"$f":"IF(ASV_Daten!B307=\"\",\"\",ASV_Daten!B307)","v":"Dziabu"},{"$f":"IF(ASV_Daten!C307=\"\",\"\",ASV_Daten!C307)","v":"Üsgül"},{"$f":"IF(ASV_Daten!D307=\"\",\"\",ASV_Daten!D307)","v":2009},{"$f":"IF(ASV_Daten!E307=\"\",\"\",ASV_Daten!E307)","v":"w"},"7dw",12,"12w",null,null,null,null,null,null,null,null,null,null,false,"nix"]
[{"$f":"IF(ASV_Daten!A308=\"\",\"\",ASV_Daten!A308)","v":"7d"},{"$f":"IF(ASV_Daten!B308=\"\",\"\",ASV_Daten!B308)","v":"Branniger"},{"$f":"IF(ASV_Daten!C308=\"\",\"\",ASV_Daten!C308)","v":"Clarissa"},{"$f":"IF(ASV_Daten!D308=\"\",\"\",ASV_Daten!D308)","v":2008},{"$f":"IF(ASV_Daten!E308=\"\",\"\",ASV_Daten!E308)","v":"w"},"7dw",13,"13w",null,null,null,null,null,null,null,null,null,null,false,"nix"]
[{"$f":"IF(ASV_Daten!A309=\"\",\"\",ASV_Daten!A309)","v":"7d"},{"$f":"IF(ASV_Daten!B309=\"\",\"\",ASV_Daten!B309)","v":"Birkus"},{"$f":"IF(ASV_Daten!C309=\"\",\"\",ASV_Daten!C309)","v":"Yvo"},{"$f":"IF(ASV_Daten!D309=\"\",\"\",ASV_Daten!D309)","v":2008},{"$f":"IF(ASV_Daten!E309=\"\",\"\",ASV_Daten!E309)","v":"w"},"7dw",13,"13w",null,null,null,null,null,null,null,null,null,null,false,"nix"]
[{"$f":"IF(ASV_Daten!A310=\"\",\"\",ASV_Daten!A310)","v":"7d"},{"$f":"IF(ASV_Daten!B310=\"\",\"\",ASV_Daten!B310)","v":"wlodomar"},{"$f":"IF(ASV_Daten!C310=\"\",\"\",ASV_Daten!C310)","v":"Hermann"},{"$f":"IF(ASV_Daten!D310=\"\",\"\",ASV_Daten!D310)","v":2008},{"$f":"IF(ASV_Daten!E310=\"\",\"\",ASV_Daten!E310)","v":"m"},"7dm",13,"13m",null,null,null,null,null,null,null,null,null,null,false,"nix"]
[{"$f":"IF(ASV_Daten!A311=\"\",\"\",ASV_Daten!A311)","v":"7d"},{"$f":"IF(ASV_Daten!B311=\"\",\"\",ASV_Daten!B311)","v":"Armbrecht"},{"$f":"IF(ASV_Daten!C311=\"\",\"\",ASV_Daten!C311)","v":"Mark"},{"$f":"IF(ASV_Daten!D311=\"\",\"\",ASV_Daten!D311)","v":2008},{"$f":"IF(ASV_Daten!E311=\"\",\"\",ASV_Daten!E311)","v":"m"},"7dm",13,"13m",null,null,null,null,null,null,null,null,null,null,false,"nix"]
[{"$f":"IF(ASV_Daten!A312=\"\",\"\",ASV_Daten!A312)","v":"7d"},{"$f":"IF(ASV_Daten!B312=\"\",\"\",ASV_Daten!B312)","v":"Adler"},{"$f":"IF(ASV_Daten!C312=\"\",\"\",ASV_Daten!C312)","v":"Marja"},{"$f":"IF(ASV_Daten!D312=\"\",\"\",ASV_Daten!D312)","v":2009},{"$f":"IF(ASV_Daten!E312=\"\",\"\",ASV_Daten!E312)","v":"w"},"7dw",12,"12w",null,null,null,null,null,null,null,null,null,null,false,"nix"]
[{"$f":"IF(ASV_Daten!A313=\"\",\"\",ASV_Daten!A313)","v":"7d"},{"$f":"IF(ASV_Daten!B313=\"\",\"\",ASV_Daten!B313)","v":"Pretlow"},{"$f":"IF(ASV_Daten!C313=\"\",\"\",ASV_Daten!C313)","v":"Janus"},{"$f":"IF(ASV_Daten!D313=\"\",\"\",ASV_Daten!D313)","v":2009},{"$f":"IF(ASV_Daten!E313=\"\",\"\",ASV_Daten!E313)","v":"m"},"7dm",12,"12m",null,null,null,null,null,null,null,null,null,null,false,"nix"]
[{"$f":"IF(ASV_Daten!A314=\"\",\"\",ASV_Daten!A314)","v":"7d"},{"$f":"IF(ASV_Daten!B314=\"\",\"\",ASV_Daten!B314)","v":"webel"},{"$f":"IF(ASV_Daten!C314=\"\",\"\",ASV_Daten!C314)","v":"Manfred"},{"$f":"IF(ASV_Daten!D314=\"\",\"\",ASV_Daten!D314)","v":2009},{"$f":"IF(ASV_Daten!E314=\"\",\"\",ASV_Daten!E314)","v":"m"},"7dm",12,"12m",null,null,null,null,null,null,null,null,null,null,false,"nix"]
[{"$f":"IF(ASV_Daten!A315=\"\",\"\",ASV_Daten!A315)","v":"7d"},{"$f":"IF(ASV_Daten!B315=\"\",\"\",ASV_Daten!B315)","v":"Dröfborn"},{"$f":"IF(ASV_Daten!C315=\"\",\"\",ASV_Daten!C315)","v":"Marik"},{"$f":"IF(ASV_Daten!D315=\"\",\"\",ASV_Daten!D315)","v":2009},{"$f":"IF(ASV_Daten!E315=\"\",\"\",ASV_Daten!E315)","v":"m"},"7dm",12,"12m",null,null,null,null,null,null,null,null,null,null,false,"nix"]
[{"$f":"IF(ASV_Daten!A316=\"\",\"\",ASV_Daten!A316)","v":"7d"},{"$f":"IF(ASV_Daten!B316=\"\",\"\",ASV_Daten!B316)","v":"Dziabu"},{"$f":"IF(ASV_Daten!C316=\"\",\"\",ASV_Daten!C316)","v":"Üsgül"},{"$f":"IF(ASV_Daten!D316=\"\",\"\",ASV_Daten!D316)","v":2009},{"$f":"IF(ASV_Daten!E316=\"\",\"\",ASV_Daten!E316)","v":"w"},"7dw",12,"12w",null,null,null,null,null,null,null,null,null,null,false,"nix"]
[{"$f":"IF(ASV_Daten!A317=\"\",\"\",ASV_Daten!A317)","v":"8a"},{"$f":"IF(ASV_Daten!B317=\"\",\"\",ASV_Daten!B317)","v":"Demar"},{"$f":"IF(ASV_Daten!C317=\"\",\"\",ASV_Daten!C317)","v":"Pascal"},{"$f":"IF(ASV_Daten!D317=\"\",\"\",ASV_Daten!D317)","v":2007},{"$f":"IF(ASV_Daten!E317=\"\",\"\",ASV_Daten!E317)","v":"m"},"8am",14,"14m",null,null,null,null,null,null,null,null,null,null,false,"nix"]
[{"$f":"IF(ASV_Daten!A318=\"\",\"\",ASV_Daten!A318)","v":"8a"},{"$f":"IF(ASV_Daten!B318=\"\",\"\",ASV_Daten!B318)","v":"Eckelor"},{"$f":"IF(ASV_Daten!C318=\"\",\"\",ASV_Daten!C318)","v":"Nic"},{"$f":"IF(ASV_Daten!D318=\"\",\"\",ASV_Daten!D318)","v":2007},{"$f":"IF(ASV_Daten!E318=\"\",\"\",ASV_Daten!E318)","v":"m"},"8am",14,"14m",null,null,null,null,null,null,null,null,null,null,false,"nix"]
[{"$f":"IF(ASV_Daten!A319=\"\",\"\",ASV_Daten!A319)","v":"8a"},{"$f":"IF(ASV_Daten!B319=\"\",\"\",ASV_Daten!B319)","v":"Büchmar"},{"$f":"IF(ASV_Daten!C319=\"\",\"\",ASV_Daten!C319)","v":"Nicole"},{"$f":"IF(ASV_Daten!D319=\"\",\"\",ASV_Daten!D319)","v":2007},{"$f":"IF(ASV_Daten!E319=\"\",\"\",ASV_Daten!E319)","v":"w"},"8aw",14,"14w",null,null,null,null,null,null,null,null,null,null,false,"nix"]
[{"$f":"IF(ASV_Daten!A320=\"\",\"\",ASV_Daten!A320)","v":"8a"},{"$f":"IF(ASV_Daten!B320=\"\",\"\",ASV_Daten!B320)","v":"Bladdow"},{"$f":"IF(ASV_Daten!C320=\"\",\"\",ASV_Daten!C320)","v":"Tin"},{"$f":"IF(ASV_Daten!D320=\"\",\"\",ASV_Daten!D320)","v":2007},{"$f":"IF(ASV_Daten!E320=\"\",\"\",ASV_Daten!E320)","v":"m"},"8am",14,"14m",null,null,null,null,null,null,null,null,null,null,false,"nix"]
[{"$f":"IF(ASV_Daten!A321=\"\",\"\",ASV_Daten!A321)","v":"8a"},{"$f":"IF(ASV_Daten!B321=\"\",\"\",ASV_Daten!B321)","v":"Böklar"},{"$f":"IF(ASV_Daten!C321=\"\",\"\",ASV_Daten!C321)","v":"Urs"},{"$f":"IF(ASV_Daten!D321=\"\",\"\",ASV_Daten!D321)","v":2007},{"$f":"IF(ASV_Daten!E321=\"\",\"\",ASV_Daten!E321)","v":"m"},"8am",14,"14m",null,null,null,null,null,null,null,null,null,null,false,"nix"]
[{"$f":"IF(ASV_Daten!A322=\"\",\"\",ASV_Daten!A322)","v":"8a"},{"$f":"IF(ASV_Daten!B322=\"\",\"\",ASV_Daten!B322)","v":"Krejsel"},{"$f":"IF(ASV_Daten!C322=\"\",\"\",ASV_Daten!C322)","v":"Carola"},{"$f":"IF(ASV_Daten!D322=\"\",\"\",ASV_Daten!D322)","v":2007},{"$f":"IF(ASV_Daten!E322=\"\",\"\",ASV_Daten!E322)","v":"w"},"8aw",14,"14w",null,null,null,null,null,null,null,null,null,null,false,"nix"]
[{"$f":"IF(ASV_Daten!A323=\"\",\"\",ASV_Daten!A323)","v":"8a"},{"$f":"IF(ASV_Daten!B323=\"\",\"\",ASV_Daten!B323)","v":"Kruwa"},{"$f":"IF(ASV_Daten!C323=\"\",\"\",ASV_Daten!C323)","v":"Lutz"},{"$f":"IF(ASV_Daten!D323=\"\",\"\",ASV_Daten!D323)","v":2007},{"$f":"IF(ASV_Daten!E323=\"\",\"\",ASV_Daten!E323)","v":"m"},"8am",14,"14m",null,null,null,null,null,null,null,null,null,null,false,"nix"]
[{"$f":"IF(ASV_Daten!A324=\"\",\"\",ASV_Daten!A324)","v":"8a"},{"$f":"IF(ASV_Daten!B324=\"\",\"\",ASV_Daten!B324)","v":"Rittkopf"},{"$f":"IF(ASV_Daten!C324=\"\",\"\",ASV_Daten!C324)","v":"Ursel"},{"$f":"IF(ASV_Daten!D324=\"\",\"\",ASV_Daten!D324)","v":2008},{"$f":"IF(ASV_Daten!E324=\"\",\"\",ASV_Daten!E324)","v":"w"},"8aw",13,"13w",null,null,null,null,null,null,null,null,null,null,false,"nix"]
[{"$f":"IF(ASV_Daten!A325=\"\",\"\",ASV_Daten!A325)","v":"8a"},{"$f":"IF(ASV_Daten!B325=\"\",\"\",ASV_Daten!B325)","v":"Demar"},{"$f":"IF(ASV_Daten!C325=\"\",\"\",ASV_Daten!C325)","v":"Pascal"},{"$f":"IF(ASV_Daten!D325=\"\",\"\",ASV_Daten!D325)","v":2007},{"$f":"IF(ASV_Daten!E325=\"\",\"\",ASV_Daten!E325)","v":"m"},"8am",14,"14m",null,null,null,null,null,null,null,null,null,null,false,"nix"]
[{"$f":"IF(ASV_Daten!A326=\"\",\"\",ASV_Daten!A326)","v":"8a"},{"$f":"IF(ASV_Daten!B326=\"\",\"\",ASV_Daten!B326)","v":"Eckelor"},{"$f":"IF(ASV_Daten!C326=\"\",\"\",ASV_Daten!C326)","v":"Nic"},{"$f":"IF(ASV_Daten!D326=\"\",\"\",ASV_Daten!D326)","v":2007},{"$f":"IF(ASV_Daten!E326=\"\",\"\",ASV_Daten!E326)","v":"m"},"8am",14,"14m",null,null,null,null,null,null,null,null,null,null,false,"nix"]
[{"$f":"IF(ASV_Daten!A327=\"\",\"\",ASV_Daten!A327)","v":"8a"},{"$f":"IF(ASV_Daten!B327=\"\",\"\",ASV_Daten!B327)","v":"Büchmar"},{"$f":"IF(ASV_Daten!C327=\"\",\"\",ASV_Daten!C327)","v":"Nicole"},{"$f":"IF(ASV_Daten!D327=\"\",\"\",ASV_Daten!D327)","v":2007},{"$f":"IF(ASV_Daten!E327=\"\",\"\",ASV_Daten!E327)","v":"w"},"8aw",14,"14w",null,null,null,null,null,null,null,null,null,null,false,"nix"]
[{"$f":"IF(ASV_Daten!A328=\"\",\"\",ASV_Daten!A328)","v":"8a"},{"$f":"IF(ASV_Daten!B328=\"\",\"\",ASV_Daten!B328)","v":"Bladdow"},{"$f":"IF(ASV_Daten!C328=\"\",\"\",ASV_Daten!C328)","v":"Tin"},{"$f":"IF(ASV_Daten!D328=\"\",\"\",ASV_Daten!D328)","v":2007},{"$f":"IF(ASV_Daten!E328=\"\",\"\",ASV_Daten!E328)","v":"m"},"8am",14,"14m",null,null,null,null,null,null,null,null,null,null,false,"nix"]
[{"$f":"IF(ASV_Daten!A329=\"\",\"\",ASV_Daten!A329)","v":"8a"},{"$f":"IF(ASV_Daten!B329=\"\",\"\",ASV_Daten!B329)","v":"Böklar"},{"$f":"IF(ASV_Daten!C329=\"\",\"\",ASV_Daten!C329)","v":"Urs"},{"$f":"IF(ASV_Daten!D329=\"\",\"\",ASV_Daten!D329)","v":2007},{"$f":"IF(ASV_Daten!E329=\"\",\"\",ASV_Daten!E329)","v":"m"},"8am",14,"14m",null,null,null,null,null,null,null,null,null,null,false,"nix"]
[{"$f":"IF(ASV_Daten!A330=\"\",\"\",ASV_Daten!A330)","v":"8a"},{"$f":"IF(ASV_Daten!B330=\"\",\"\",ASV_Daten!B330)","v":"Krejsel"},{"$f":"IF(ASV_Daten!C330=\"\",\"\",ASV_Daten!C330)","v":"Carola"},{"$f":"IF(ASV_Daten!D330=\"\",\"\",ASV_Daten!D330)","v":2007},{"$f":"IF(ASV_Daten!E330=\"\",\"\",ASV_Daten!E330)","v":"w"},"8aw",14,"14w",null,null,null,null,null,null,null,null,null,null,false,"nix"]
[{"$f":"IF(ASV_Daten!A331=\"\",\"\",ASV_Daten!A331)","v":"8a"},{"$f":"IF(ASV_Daten!B331=\"\",\"\",ASV_Daten!B331)","v":"Kruwa"},{"$f":"IF(ASV_Daten!C331=\"\",\"\",ASV_Daten!C331)","v":"Lutz"},{"$f":"IF(ASV_Daten!D331=\"\",\"\",ASV_Daten!D331)","v":2007},{"$f":"IF(ASV_Daten!E331=\"\",\"\",ASV_Daten!E331)","v":"m"},"8am",14,"14m",null,null,null,null,null,null,null,null,null,null,false,"nix"]
[{"$f":"IF(ASV_Daten!A332=\"\",\"\",ASV_Daten!A332)","v":"8a"},{"$f":"IF(ASV_Daten!B332=\"\",\"\",ASV_Daten!B332)","v":"Rittkopf"},{"$f":"IF(ASV_Daten!C332=\"\",\"\",ASV_Daten!C332)","v":"Ursel"},{"$f":"IF(ASV_Daten!D332=\"\",\"\",ASV_Daten!D332)","v":2008},{"$f":"IF(ASV_Daten!E332=\"\",\"\",ASV_Daten!E332)","v":"w"},"8aw",13,"13w",null,null,null,null,null,null,null,null,null,null,false,"nix"]
[{"$f":"IF(ASV_Daten!A333=\"\",\"\",ASV_Daten!A333)","v":"8a"},{"$f":"IF(ASV_Daten!B333=\"\",\"\",ASV_Daten!B333)","v":"Demar"},{"$f":"IF(ASV_Daten!C333=\"\",\"\",ASV_Daten!C333)","v":"Pascal"},{"$f":"IF(ASV_Daten!D333=\"\",\"\",ASV_Daten!D333)","v":2007},{"$f":"IF(ASV_Daten!E333=\"\",\"\",ASV_Daten!E333)","v":"m"},"8am",14,"14m",null,null,null,null,null,null,null,null,null,null,false,"nix"]
[{"$f":"IF(ASV_Daten!A334=\"\",\"\",ASV_Daten!A334)","v":"8a"},{"$f":"IF(ASV_Daten!B334=\"\",\"\",ASV_Daten!B334)","v":"Eckelor"},{"$f":"IF(ASV_Daten!C334=\"\",\"\",ASV_Daten!C334)","v":"Nic"},{"$f":"IF(ASV_Daten!D334=\"\",\"\",ASV_Daten!D334)","v":2007},{"$f":"IF(ASV_Daten!E334=\"\",\"\",ASV_Daten!E334)","v":"m"},"8am",14,"14m",null,null,null,null,null,null,null,null,null,null,false,"nix"]
[{"$f":"IF(ASV_Daten!A335=\"\",\"\",ASV_Daten!A335)","v":"8a"},{"$f":"IF(ASV_Daten!B335=\"\",\"\",ASV_Daten!B335)","v":"Büchmar"},{"$f":"IF(ASV_Daten!C335=\"\",\"\",ASV_Daten!C335)","v":"Nicole"},{"$f":"IF(ASV_Daten!D335=\"\",\"\",ASV_Daten!D335)","v":2007},{"$f":"IF(ASV_Daten!E335=\"\",\"\",ASV_Daten!E335)","v":"w"},"8aw",14,"14w",null,null,null,null,null,null,null,null,null,null,false,"nix"]
[{"$f":"IF(ASV_Daten!A336=\"\",\"\",ASV_Daten!A336)","v":"8a"},{"$f":"IF(ASV_Daten!B336=\"\",\"\",ASV_Daten!B336)","v":"Bladdow"},{"$f":"IF(ASV_Daten!C336=\"\",\"\",ASV_Daten!C336)","v":"Tin"},{"$f":"IF(ASV_Daten!D336=\"\",\"\",ASV_Daten!D336)","v":2007},{"$f":"IF(ASV_Daten!E336=\"\",\"\",ASV_Daten!E336)","v":"m"},"8am",14,"14m",null,null,null,null,null,null,null,null,null,null,false,"nix"]
[{"$f":"IF(ASV_Daten!A337=\"\",\"\",ASV_Daten!A337)","v":"8a"},{"$f":"IF(ASV_Daten!B337=\"\",\"\",ASV_Daten!B337)","v":"Böklar"},{"$f":"IF(ASV_Daten!C337=\"\",\"\",ASV_Daten!C337)","v":"Urs"},{"$f":"IF(ASV_Daten!D337=\"\",\"\",ASV_Daten!D337)","v":2007},{"$f":"IF(ASV_Daten!E337=\"\",\"\",ASV_Daten!E337)","v":"m"},"8am",14,"14m",null,null,null,null,null,null,null,null,null,null,false,"nix"]
[{"$f":"IF(ASV_Daten!A338=\"\",\"\",ASV_Daten!A338)","v":"8a"},{"$f":"IF(ASV_Daten!B338=\"\",\"\",ASV_Daten!B338)","v":"Krejsel"},{"$f":"IF(ASV_Daten!C338=\"\",\"\",ASV_Daten!C338)","v":"Carola"},{"$f":"IF(ASV_Daten!D338=\"\",\"\",ASV_Daten!D338)","v":2007},{"$f":"IF(ASV_Daten!E338=\"\",\"\",ASV_Daten!E338)","v":"w"},"8aw",14,"14w",null,null,null,null,null,null,null,null,null,null,false,"nix"]
[{"$f":"IF(ASV_Daten!A339=\"\",\"\",ASV_Daten!A339)","v":"8a"},{"$f":"IF(ASV_Daten!B339=\"\",\"\",ASV_Daten!B339)","v":"Kruwa"},{"$f":"IF(ASV_Daten!C339=\"\",\"\",ASV_Daten!C339)","v":"Lutz"},{"$f":"IF(ASV_Daten!D339=\"\",\"\",ASV_Daten!D339)","v":2007},{"$f":"IF(ASV_Daten!E339=\"\",\"\",ASV_Daten!E339)","v":"m"},"8am",14,"14m",null,null,null,null,null,null,null,null,null,null,false,"nix"]
[{"$f":"IF(ASV_Daten!A340=\"\",\"\",ASV_Daten!A340)","v":"8a"},{"$f":"IF(ASV_Daten!B340=\"\",\"\",ASV_Daten!B340)","v":"Rittkopf"},{"$f":"IF(ASV_Daten!C340=\"\",\"\",ASV_Daten!C340)","v":"Ursel"},{"$f":"IF(ASV_Daten!D340=\"\",\"\",ASV_Daten!D340)","v":2008},{"$f":"IF(ASV_Daten!E340=\"\",\"\",ASV_Daten!E340)","v":"w"},"8aw",13,"13w",null,null,null,null,null,null,null,null,null,null,{"$f":"IF(AND(A341=\"1a\",E341=\"m\"),\"N1m\",IF(AND(A341=\"1a\",E341=\"w\"),\"N1w\",IF(AND(A341=\"1b\",E341=\"w\"),\"N1w\",IF(AND(A341=\"1b\",E341=\"m\"),\"N1m\",IF(AND(A341=\"2a\",E341=\"m\"),\"N2m\",IF(AND(A341=\"2a\",E341=\"w\"),\"N2w\",IF(AND(A341=\"2b\",E341=\"w\"),\"N2w\",IF(AND(A341=\"2b\",E341=\"m\"),\"N2m\",IF(AND(A341=\"3a\",E341=\"m\"),\"N3m\",IF(AND(A341=\"3a\",E341=\"w\"),\"N3w\",IF(AND(A341=\"3b\",E341=\"w\"),\"N3w\",IF(AND(A341=\"3b\",E341=\"m\"),\"N3m\",IF(AND(A341=\"4a\",E341=\"m\"),\"N4m\",IF(AND(A341=\"4a\",E341=\"w\"),\"N4w\",IF(AND(A341=\"4b\",E341=\"m\"),\"N4m\",IF(AND(A341=\"4b\",E341=\"w\"),\"N4w\"))))))))))))))))","v":false},{"$f":"IF(S341=\"n1m\",VLOOKUP(Q341,N1m,2),IF(S341=\"N1w\",VLOOKUP(Q341,N1w,2),IF(S341=\"N2m\",VLOOKUP(Q341,n2m,2),IF(S341=\"N2w\",VLOOKUP(Q341,n2w,2),IF(S341=\"N3w\",VLOOKUP(Q341,n3w,2),IF(S341=\"N3m\",VLOOKUP(Q341,n3m,2),IF(S341=\"N4w\",VLOOKUP(Q341,n4w,2),IF(S341=\"N4m\",VLOOKUP(Q341,n4m,2),\"nix\"))))))))","v":"nix"}]
[{"$f":"IF(ASV_Daten!A341=\"\",\"\",ASV_Daten!A341)","v":"8b"},{"$f":"IF(ASV_Daten!B341=\"\",\"\",ASV_Daten!B341)","v":"Desczyk"},{"$f":"IF(ASV_Daten!C341=\"\",\"\",ASV_Daten!C341)","v":"Margot"},{"$f":"IF(ASV_Daten!D341=\"\",\"\",ASV_Daten!D341)","v":2007},{"$f":"IF(ASV_Daten!E341=\"\",\"\",ASV_Daten!E341)","v":"w"},"8bw",14,"14w",null,null,null,null,null,null,null,null,null,null,false,"nix"]
[{"$f":"IF(ASV_Daten!A342=\"\",\"\",ASV_Daten!A342)","v":"8b"},{"$f":"IF(ASV_Daten!B342=\"\",\"\",ASV_Daten!B342)","v":"Meyer"},{"$f":"IF(ASV_Daten!C342=\"\",\"\",ASV_Daten!C342)","v":"Franziska"},{"$f":"IF(ASV_Daten!D342=\"\",\"\",ASV_Daten!D342)","v":2007},{"$f":"IF(ASV_Daten!E342=\"\",\"\",ASV_Daten!E342)","v":"w"},"8bw",14,"14w",null,null,null,null,null,null,null,null,null,null,false,"nix"]
[{"$f":"IF(ASV_Daten!A343=\"\",\"\",ASV_Daten!A343)","v":"8b"},{"$f":"IF(ASV_Daten!B343=\"\",\"\",ASV_Daten!B343)","v":"Kuhner "},{"$f":"IF(ASV_Daten!C343=\"\",\"\",ASV_Daten!C343)","v":"Miriam"},{"$f":"IF(ASV_Daten!D343=\"\",\"\",ASV_Daten!D343)","v":2008},{"$f":"IF(ASV_Daten!E343=\"\",\"\",ASV_Daten!E343)","v":"w"},{"$f":"A344&E344","v":"8bw"},{"$f":"IF(D344=\"\",\"\",$B$1-$D344)","v":13},{"$f":"G344&E344","v":"13w"},null,null,null,null,null,null,null,null,null,null,false,"nix"]
[{"$f":"IF(ASV_Daten!A344=\"\",\"\",ASV_Daten!A344)","v":"8b"},{"$f":"IF(ASV_Daten!B344=\"\",\"\",ASV_Daten!B344)","v":"Luban"},{"$f":"IF(ASV_Daten!C344=\"\",\"\",ASV_Daten!C344)","v":"Ludwig"},{"$f":"IF(ASV_Daten!D344=\"\",\"\",ASV_Daten!D344)","v":2008},{"$f":"IF(ASV_Daten!E344=\"\",\"\",ASV_Daten!E344)","v":"m"},"8bm",13,"13m",null,null,null,null,null,null,null,null,null,null,false,"nix"]
[{"$f":"IF(ASV_Daten!A345=\"\",\"\",ASV_Daten!A345)","v":"8b"},{"$f":"IF(ASV_Daten!B345=\"\",\"\",ASV_Daten!B345)","v":"Redmann"},{"$f":"IF(ASV_Daten!C345=\"\",\"\",ASV_Daten!C345)","v":"Georg"},{"$f":"IF(ASV_Daten!D345=\"\",\"\",ASV_Daten!D345)","v":2008},{"$f":"IF(ASV_Daten!E345=\"\",\"\",ASV_Daten!E345)","v":"m"},"8bm",13,"13m",null,null,null,null,null,null,null,null,null,null,false,"nix"]
[{"$f":"IF(ASV_Daten!A346=\"\",\"\",ASV_Daten!A346)","v":"8b"},{"$f":"IF(ASV_Daten!B346=\"\",\"\",ASV_Daten!B346)","v":"Scheunemann"},{"$f":"IF(ASV_Daten!C346=\"\",\"\",ASV_Daten!C346)","v":"Sybille"},{"$f":"IF(ASV_Daten!D346=\"\",\"\",ASV_Daten!D346)","v":2008},{"$f":"IF(ASV_Daten!E346=\"\",\"\",ASV_Daten!E346)","v":"w"},"8bw",13,"13w",null,null,null,null,null,null,null,null,null,null,false,"nix"]
[{"$f":"IF(ASV_Daten!A347=\"\",\"\",ASV_Daten!A347)","v":"8b"},{"$f":"IF(ASV_Daten!B347=\"\",\"\",ASV_Daten!B347)","v":"Hoffemann"},{"$f":"IF(ASV_Daten!C347=\"\",\"\",ASV_Daten!C347)","v":"Ute"},{"$f":"IF(ASV_Daten!D347=\"\",\"\",ASV_Daten!D347)","v":2008},{"$f":"IF(ASV_Daten!E347=\"\",\"\",ASV_Daten!E347)","v":"w"},"8bw",13,"13w",null,null,null,null,null,null,null,null,null,null,false,"nix"]
[{"$f":"IF(ASV_Daten!A348=\"\",\"\",ASV_Daten!A348)","v":"8b"},{"$f":"IF(ASV_Daten!B348=\"\",\"\",ASV_Daten!B348)","v":"Hahnemann"},{"$f":"IF(ASV_Daten!C348=\"\",\"\",ASV_Daten!C348)","v":"Ursula"},{"$f":"IF(ASV_Daten!D348=\"\",\"\",ASV_Daten!D348)","v":2008},{"$f":"IF(ASV_Daten!E348=\"\",\"\",ASV_Daten!E348)","v":"w"},"8bw",13,"13w",null,null,null,null,null,null,null,null,null,null,false,"nix"]
[{"$f":"IF(ASV_Daten!A349=\"\",\"\",ASV_Daten!A349)","v":"8b"},{"$f":"IF(ASV_Daten!B349=\"\",\"\",ASV_Daten!B349)","v":"Desczyk"},{"$f":"IF(ASV_Daten!C349=\"\",\"\",ASV_Daten!C349)","v":"Margot"},{"$f":"IF(ASV_Daten!D349=\"\",\"\",ASV_Daten!D349)","v":2007},{"$f":"IF(ASV_Daten!E349=\"\",\"\",ASV_Daten!E349)","v":"w"},"8bw",14,"14w",null,null,null,null,null,null,null,null,null,null,false,"nix"]
[{"$f":"IF(ASV_Daten!A350=\"\",\"\",ASV_Daten!A350)","v":"8b"},{"$f":"IF(ASV_Daten!B350=\"\",\"\",ASV_Daten!B350)","v":"Meyer"},{"$f":"IF(ASV_Daten!C350=\"\",\"\",ASV_Daten!C350)","v":"Franziska"},{"$f":"IF(ASV_Daten!D350=\"\",\"\",ASV_Daten!D350)","v":2007},{"$f":"IF(ASV_Daten!E350=\"\",\"\",ASV_Daten!E350)","v":"w"},"8bw",14,"14w",null,null,null,null,null,null,null,null,null,null,false,"nix"]
[{"$f":"IF(ASV_Daten!A351=\"\",\"\",ASV_Daten!A351)","v":"8b"},{"$f":"IF(ASV_Daten!B351=\"\",\"\",ASV_Daten!B351)","v":"Kuhner "},{"$f":"IF(ASV_Daten!C351=\"\",\"\",ASV_Daten!C351)","v":"Miriam"},{"$f":"IF(ASV_Daten!D351=\"\",\"\",ASV_Daten!D351)","v":2008},{"$f":"IF(ASV_Daten!E351=\"\",\"\",ASV_Daten!E351)","v":"w"},"8bw",13,"13w",null,null,null,null,null,null,null,null,null,null,false,"nix"]
[{"$f":"IF(ASV_Daten!A352=\"\",\"\",ASV_Daten!A352)","v":"8b"},{"$f":"IF(ASV_Daten!B352=\"\",\"\",ASV_Daten!B352)","v":"Luban"},{"$f":"IF(ASV_Daten!C352=\"\",\"\",ASV_Daten!C352)","v":"Ludwig"},{"$f":"IF(ASV_Daten!D352=\"\",\"\",ASV_Daten!D352)","v":2008},{"$f":"IF(ASV_Daten!E352=\"\",\"\",ASV_Daten!E352)","v":"m"},"8bm",13,"13m",null,null,null,null,null,null,null,null,null,null,false,"nix"]
[{"$f":"IF(ASV_Daten!A353=\"\",\"\",ASV_Daten!A353)","v":"8b"},{"$f":"IF(ASV_Daten!B353=\"\",\"\",ASV_Daten!B353)","v":"Redmann"},{"$f":"IF(ASV_Daten!C353=\"\",\"\",ASV_Daten!C353)","v":"Georg"},{"$f":"IF(ASV_Daten!D353=\"\",\"\",ASV_Daten!D353)","v":2008},{"$f":"IF(ASV_Daten!E353=\"\",\"\",ASV_Daten!E353)","v":"m"},"8bm",13,"13m",null,null,null,null,null,null,null,null,null,null,false,"nix"]
[{"$f":"IF(ASV_Daten!A354=\"\",\"\",ASV_Daten!A354)","v":"8b"},{"$f":"IF(ASV_Daten!B354=\"\",\"\",ASV_Daten!B354)","v":"Scheunemann"},{"$f":"IF(ASV_Daten!C354=\"\",\"\",ASV_Daten!C354)","v":"Sybille"},{"$f":"IF(ASV_Daten!D354=\"\",\"\",ASV_Daten!D354)","v":2008},{"$f":"IF(ASV_Daten!E354=\"\",\"\",ASV_Daten!E354)","v":"w"},"8bw",13,"13w",null,null,null,null,null,null,null,null,null,null,false,"nix"]
[{"$f":"IF(ASV_Daten!A355=\"\",\"\",ASV_Daten!A355)","v":"8b"},{"$f":"IF(ASV_Daten!B355=\"\",\"\",ASV_Daten!B355)","v":"Hoffemann"},{"$f":"IF(ASV_Daten!C355=\"\",\"\",ASV_Daten!C355)","v":"Ute"},{"$f":"IF(ASV_Daten!D355=\"\",\"\",ASV_Daten!D355)","v":2008},{"$f":"IF(ASV_Daten!E355=\"\",\"\",ASV_Daten!E355)","v":"w"},"8bw",13,"13w",null,null,null,null,null,null,null,null,null,null,false,"nix"]
[{"$f":"IF(ASV_Daten!A356=\"\",\"\",ASV_Daten!A356)","v":"8b"},{"$f":"IF(ASV_Daten!B356=\"\",\"\",ASV_Daten!B356)","v":"Hahnemann"},{"$f":"IF(ASV_Daten!C356=\"\",\"\",ASV_Daten!C356)","v":"Ursula"},{"$f":"IF(ASV_Daten!D356=\"\",\"\",ASV_Daten!D356)","v":2008},{"$f":"IF(ASV_Daten!E356=\"\",\"\",ASV_Daten!E356)","v":"w"},"8bw",13,"13w",null,null,null,null,null,null,null,null,null,null,false,"nix"]
[{"$f":"IF(ASV_Daten!A357=\"\",\"\",ASV_Daten!A357)","v":"8b"},{"$f":"IF(ASV_Daten!B357=\"\",\"\",ASV_Daten!B357)","v":"Desczyk"},{"$f":"IF(ASV_Daten!C357=\"\",\"\",ASV_Daten!C357)","v":"Margot"},{"$f":"IF(ASV_Daten!D357=\"\",\"\",ASV_Daten!D357)","v":2007},{"$f":"IF(ASV_Daten!E357=\"\",\"\",ASV_Daten!E357)","v":"w"},"8bw",14,"14w",null,null,null,null,null,null,null,null,null,null,false,"nix"]
[{"$f":"IF(ASV_Daten!A358=\"\",\"\",ASV_Daten!A358)","v":"8b"},{"$f":"IF(ASV_Daten!B358=\"\",\"\",ASV_Daten!B358)","v":"Meyer"},{"$f":"IF(ASV_Daten!C358=\"\",\"\",ASV_Daten!C358)","v":"Franziska"},{"$f":"IF(ASV_Daten!D358=\"\",\"\",ASV_Daten!D358)","v":2007},{"$f":"IF(ASV_Daten!E358=\"\",\"\",ASV_Daten!E358)","v":"w"},"8bw",14,"14w",null,null,null,null,null,null,null,null,null,null,false,"nix"]
[{"$f":"IF(ASV_Daten!A359=\"\",\"\",ASV_Daten!A359)","v":"8b"},{"$f":"IF(ASV_Daten!B359=\"\",\"\",ASV_Daten!B359)","v":"Kuhner "},{"$f":"IF(ASV_Daten!C359=\"\",\"\",ASV_Daten!C359)","v":"Miriam"},{"$f":"IF(ASV_Daten!D359=\"\",\"\",ASV_Daten!D359)","v":2008},{"$f":"IF(ASV_Daten!E359=\"\",\"\",ASV_Daten!E359)","v":"w"},"8bw",13,"13w",null,null,null,null,null,null,null,null,null,null,false,"nix"]
[{"$f":"IF(ASV_Daten!A360=\"\",\"\",ASV_Daten!A360)","v":"8b"},{"$f":"IF(ASV_Daten!B360=\"\",\"\",ASV_Daten!B360)","v":"Luban"},{"$f":"IF(ASV_Daten!C360=\"\",\"\",ASV_Daten!C360)","v":"Ludwig"},{"$f":"IF(ASV_Daten!D360=\"\",\"\",ASV_Daten!D360)","v":2008},{"$f":"IF(ASV_Daten!E360=\"\",\"\",ASV_Daten!E360)","v":"m"},"8bm",13,"13m",null,null,null,null,null,null,null,null,null,null,false,"nix"]
[{"$f":"IF(ASV_Daten!A361=\"\",\"\",ASV_Daten!A361)","v":"8b"},{"$f":"IF(ASV_Daten!B361=\"\",\"\",ASV_Daten!B361)","v":"Redmann"},{"$f":"IF(ASV_Daten!C361=\"\",\"\",ASV_Daten!C361)","v":"Georg"},{"$f":"IF(ASV_Daten!D361=\"\",\"\",ASV_Daten!D361)","v":2008},{"$f":"IF(ASV_Daten!E361=\"\",\"\",ASV_Daten!E361)","v":"m"},"8bm",13,"13m",null,null,null,null,null,null,null,null,null,null,false,"nix"]
[{"$f":"IF(ASV_Daten!A362=\"\",\"\",ASV_Daten!A362)","v":"8b"},{"$f":"IF(ASV_Daten!B362=\"\",\"\",ASV_Daten!B362)","v":"Scheunemann"},{"$f":"IF(ASV_Daten!C362=\"\",\"\",ASV_Daten!C362)","v":"Sybille"},{"$f":"IF(ASV_Daten!D362=\"\",\"\",ASV_Daten!D362)","v":2008},{"$f":"IF(ASV_Daten!E362=\"\",\"\",ASV_Daten!E362)","v":"w"},"8bw",13,"13w",null,null,null,null,null,null,null,null,null,null,false,"nix"]
[{"$f":"IF(ASV_Daten!A363=\"\",\"\",ASV_Daten!A363)","v":"8b"},{"$f":"IF(ASV_Daten!B363=\"\",\"\",ASV_Daten!B363)","v":"Hoffemann"},{"$f":"IF(ASV_Daten!C363=\"\",\"\",ASV_Daten!C363)","v":"Ute"},{"$f":"IF(ASV_Daten!D363=\"\",\"\",ASV_Daten!D363)","v":2008},{"$f":"IF(ASV_Daten!E363=\"\",\"\",ASV_Daten!E363)","v":"w"},"8bw",13,"13w",null,null,null,null,null,null,null,null,null,null,false,"nix"]
[{"$f":"IF(ASV_Daten!A364=\"\",\"\",ASV_Daten!A364)","v":"8b"},{"$f":"IF(ASV_Daten!B364=\"\",\"\",ASV_Daten!B364)","v":"Hahnemann"},{"$f":"IF(ASV_Daten!C364=\"\",\"\",ASV_Daten!C364)","v":"Ursula"},{"$f":"IF(ASV_Daten!D364=\"\",\"\",ASV_Daten!D364)","v":2008},{"$f":"IF(ASV_Daten!E364=\"\",\"\",ASV_Daten!E364)","v":"w"},"8bw",13,"13w",null,null,null,null,null,null,null,null,null,null,false,"nix"]
[{"$f":"IF(ASV_Daten!A365=\"\",\"\",ASV_Daten!A365)","v":"8c"},{"$f":"IF(ASV_Daten!B365=\"\",\"\",ASV_Daten!B365)","v":"Rieser"},{"$f":"IF(ASV_Daten!C365=\"\",\"\",ASV_Daten!C365)","v":"Jennifer"},{"$f":"IF(ASV_Daten!D365=\"\",\"\",ASV_Daten!D365)","v":2008},{"$f":"IF(ASV_Daten!E365=\"\",\"\",ASV_Daten!E365)","v":"w"},"8cw",13,"13w",null,null,null,null,null,null,null,null,null,null,false,"nix"]
[{"$f":"IF(ASV_Daten!A366=\"\",\"\",ASV_Daten!A366)","v":"8c"},{"$f":"IF(ASV_Daten!B366=\"\",\"\",ASV_Daten!B366)","v":"Thürbald"},{"$f":"IF(ASV_Daten!C366=\"\",\"\",ASV_Daten!C366)","v":"Kati"},{"$f":"IF(ASV_Daten!D366=\"\",\"\",ASV_Daten!D366)","v":2008},{"$f":"IF(ASV_Daten!E366=\"\",\"\",ASV_Daten!E366)","v":"w"},"8cw",13,"13w",null,null,null,null,null,null,null,null,null,null,false,"nix"]
[{"$f":"IF(ASV_Daten!A367=\"\",\"\",ASV_Daten!A367)","v":"8c"},{"$f":"IF(ASV_Daten!B367=\"\",\"\",ASV_Daten!B367)","v":"Kieth"},{"$f":"IF(ASV_Daten!C367=\"\",\"\",ASV_Daten!C367)","v":"Alfred"},{"$f":"IF(ASV_Daten!D367=\"\",\"\",ASV_Daten!D367)","v":2008},{"$f":"IF(ASV_Daten!E367=\"\",\"\",ASV_Daten!E367)","v":"m"},"8cm",13,"13m",null,null,null,null,null,null,null,null,null,null,false,"nix"]
[{"$f":"IF(ASV_Daten!A368=\"\",\"\",ASV_Daten!A368)","v":"8c"},{"$f":"IF(ASV_Daten!B368=\"\",\"\",ASV_Daten!B368)","v":"Müller"},{"$f":"IF(ASV_Daten!C368=\"\",\"\",ASV_Daten!C368)","v":"Anna"},{"$f":"IF(ASV_Daten!D368=\"\",\"\",ASV_Daten!D368)","v":2007},{"$f":"IF(ASV_Daten!E368=\"\",\"\",ASV_Daten!E368)","v":"w"},"8cw",14,"14w",null,null,null,null,null,null,null,null,null,null,false,"nix"]
[{"$f":"IF(ASV_Daten!A369=\"\",\"\",ASV_Daten!A369)","v":"8c"},{"$f":"IF(ASV_Daten!B369=\"\",\"\",ASV_Daten!B369)","v":"Brüning"},{"$f":"IF(ASV_Daten!C369=\"\",\"\",ASV_Daten!C369)","v":"Gustav"},{"$f":"IF(ASV_Daten!D369=\"\",\"\",ASV_Daten!D369)","v":2007},{"$f":"IF(ASV_Daten!E369=\"\",\"\",ASV_Daten!E369)","v":"m"},"8cm",14,"14m",null,null,null,null,null,null,null,null,null,null,false,"nix"]
[{"$f":"IF(ASV_Daten!A370=\"\",\"\",ASV_Daten!A370)","v":"8c"},{"$f":"IF(ASV_Daten!B370=\"\",\"\",ASV_Daten!B370)","v":"weber"},{"$f":"IF(ASV_Daten!C370=\"\",\"\",ASV_Daten!C370)","v":"Ferdinand"},{"$f":"IF(ASV_Daten!D370=\"\",\"\",ASV_Daten!D370)","v":2007},{"$f":"IF(ASV_Daten!E370=\"\",\"\",ASV_Daten!E370)","v":"m"},"8cm",14,"14m",null,null,null,null,null,null,null,null,null,null,false,"nix"]
[{"$f":"IF(ASV_Daten!A371=\"\",\"\",ASV_Daten!A371)","v":"8c"},{"$f":"IF(ASV_Daten!B371=\"\",\"\",ASV_Daten!B371)","v":"Müller"},{"$f":"IF(ASV_Daten!C371=\"\",\"\",ASV_Daten!C371)","v":"Lisa"},{"$f":"IF(ASV_Daten!D371=\"\",\"\",ASV_Daten!D371)","v":2007},{"$f":"IF(ASV_Daten!E371=\"\",\"\",ASV_Daten!E371)","v":"w"},"8cw",14,"14w",null,null,null,null,null,null,null,null,null,null,false,"nix"]
[{"$f":"IF(ASV_Daten!A372=\"\",\"\",ASV_Daten!A372)","v":"8c"},{"$f":"IF(ASV_Daten!B372=\"\",\"\",ASV_Daten!B372)","v":"Hartung"},{"$f":"IF(ASV_Daten!C372=\"\",\"\",ASV_Daten!C372)","v":"Ulla"},{"$f":"IF(ASV_Daten!D372=\"\",\"\",ASV_Daten!D372)","v":2007},{"$f":"IF(ASV_Daten!E372=\"\",\"\",ASV_Daten!E372)","v":"w"},"8cw",14,"14w",null,null,null,null,null,null,null,null,null,null,false,"nix"]
[{"$f":"IF(ASV_Daten!A373=\"\",\"\",ASV_Daten!A373)","v":"8c"},{"$f":"IF(ASV_Daten!B373=\"\",\"\",ASV_Daten!B373)","v":"Reichmann"},{"$f":"IF(ASV_Daten!C373=\"\",\"\",ASV_Daten!C373)","v":"Hanns"},{"$f":"IF(ASV_Daten!D373=\"\",\"\",ASV_Daten!D373)","v":2007},{"$f":"IF(ASV_Daten!E373=\"\",\"\",ASV_Daten!E373)","v":"m"},"8cm",14,"14m",null,null,null,null,null,null,null,null,null,null,false,"nix"]
[{"$f":"IF(ASV_Daten!A374=\"\",\"\",ASV_Daten!A374)","v":"8c"},{"$f":"IF(ASV_Daten!B374=\"\",\"\",ASV_Daten!B374)","v":"Rieser"},{"$f":"IF(ASV_Daten!C374=\"\",\"\",ASV_Daten!C374)","v":"Jennifer"},{"$f":"IF(ASV_Daten!D374=\"\",\"\",ASV_Daten!D374)","v":2008},{"$f":"IF(ASV_Daten!E374=\"\",\"\",ASV_Daten!E374)","v":"w"},"8cw",13,"13w",null,null,null,null,null,null,null,null,null,null,false,"nix"]
[{"$f":"IF(ASV_Daten!A375=\"\",\"\",ASV_Daten!A375)","v":"8c"},{"$f":"IF(ASV_Daten!B375=\"\",\"\",ASV_Daten!B375)","v":"Thürbald"},{"$f":"IF(ASV_Daten!C375=\"\",\"\",ASV_Daten!C375)","v":"Kati"},{"$f":"IF(ASV_Daten!D375=\"\",\"\",ASV_Daten!D375)","v":2008},{"$f":"IF(ASV_Daten!E375=\"\",\"\",ASV_Daten!E375)","v":"w"},"8cw",13,"13w",null,null,null,null,null,null,null,null,null,null,false,"nix"]
[{"$f":"IF(ASV_Daten!A376=\"\",\"\",ASV_Daten!A376)","v":"8c"},{"$f":"IF(ASV_Daten!B376=\"\",\"\",ASV_Daten!B376)","v":"Kieth"},{"$f":"IF(ASV_Daten!C376=\"\",\"\",ASV_Daten!C376)","v":"Alfred"},{"$f":"IF(ASV_Daten!D376=\"\",\"\",ASV_Daten!D376)","v":2008},{"$f":"IF(ASV_Daten!E376=\"\",\"\",ASV_Daten!E376)","v":"m"},"8cm",13,"13m",null,null,null,null,null,null,null,null,null,null,false,"nix"]
[{"$f":"IF(ASV_Daten!A377=\"\",\"\",ASV_Daten!A377)","v":"8c"},{"$f":"IF(ASV_Daten!B377=\"\",\"\",ASV_Daten!B377)","v":"Müller"},{"$f":"IF(ASV_Daten!C377=\"\",\"\",ASV_Daten!C377)","v":"Anna"},{"$f":"IF(ASV_Daten!D377=\"\",\"\",ASV_Daten!D377)","v":2007},{"$f":"IF(ASV_Daten!E377=\"\",\"\",ASV_Daten!E377)","v":"w"},"8cw",14,"14w",null,null,null,null,null,null,null,null,null,null,false,"nix"]
[{"$f":"IF(ASV_Daten!A378=\"\",\"\",ASV_Daten!A378)","v":"8c"},{"$f":"IF(ASV_Daten!B378=\"\",\"\",ASV_Daten!B378)","v":"Brüning"},{"$f":"IF(ASV_Daten!C378=\"\",\"\",ASV_Daten!C378)","v":"Gustav"},{"$f":"IF(ASV_Daten!D378=\"\",\"\",ASV_Daten!D378)","v":2007},{"$f":"IF(ASV_Daten!E378=\"\",\"\",ASV_Daten!E378)","v":"m"},"8cm",14,"14m",null,null,null,null,null,null,null,null,null,null,false,"nix"]
[{"$f":"IF(ASV_Daten!A379=\"\",\"\",ASV_Daten!A379)","v":"8c"},{"$f":"IF(ASV_Daten!B379=\"\",\"\",ASV_Daten!B379)","v":"weber"},{"$f":"IF(ASV_Daten!C379=\"\",\"\",ASV_Daten!C379)","v":"Ferdinand"},{"$f":"IF(ASV_Daten!D379=\"\",\"\",ASV_Daten!D379)","v":2007},{"$f":"IF(ASV_Daten!E379=\"\",\"\",ASV_Daten!E379)","v":"m"},"8cm",14,"14m",null,null,null,null,null,null,null,null,null,null,false,"nix"]
[{"$f":"IF(ASV_Daten!A380=\"\",\"\",ASV_Daten!A380)","v":"8c"},{"$f":"IF(ASV_Daten!B380=\"\",\"\",ASV_Daten!B380)","v":"Müller"},{"$f":"IF(ASV_Daten!C380=\"\",\"\",ASV_Daten!C380)","v":"Lisa"},{"$f":"IF(ASV_Daten!D380=\"\",\"\",ASV_Daten!D380)","v":2007},{"$f":"IF(ASV_Daten!E380=\"\",\"\",ASV_Daten!E380)","v":"w"},"8cw",14,"14w",null,null,null,null,null,null,null,null,null,null,false,"nix"]
[{"$f":"IF(ASV_Daten!A381=\"\",\"\",ASV_Daten!A381)","v":"8c"},{"$f":"IF(ASV_Daten!B381=\"\",\"\",ASV_Daten!B381)","v":"Hartung"},{"$f":"IF(ASV_Daten!C381=\"\",\"\",ASV_Daten!C381)","v":"Ulla"},{"$f":"IF(ASV_Daten!D381=\"\",\"\",ASV_Daten!D381)","v":2007},{"$f":"IF(ASV_Daten!E381=\"\",\"\",ASV_Daten!E381)","v":"w"},"8cw",14,"14w",null,null,null,null,null,null,null,null,null,null,false,"nix"]
[{"$f":"IF(ASV_Daten!A382=\"\",\"\",ASV_Daten!A382)","v":"8c"},{"$f":"IF(ASV_Daten!B382=\"\",\"\",ASV_Daten!B382)","v":"Reichmann"},{"$f":"IF(ASV_Daten!C382=\"\",\"\",ASV_Daten!C382)","v":"Hanns"},{"$f":"IF(ASV_Daten!D382=\"\",\"\",ASV_Daten!D382)","v":2007},{"$f":"IF(ASV_Daten!E382=\"\",\"\",ASV_Daten!E382)","v":"m"},"8cm",14,"14m",null,null,null,null,null,null,null,null,null,null,false,"nix"]
[{"$f":"IF(ASV_Daten!A383=\"\",\"\",ASV_Daten!A383)","v":"8c"},{"$f":"IF(ASV_Daten!B383=\"\",\"\",ASV_Daten!B383)","v":"Rieser"},{"$f":"IF(ASV_Daten!C383=\"\",\"\",ASV_Daten!C383)","v":"Jennifer"},{"$f":"IF(ASV_Daten!D383=\"\",\"\",ASV_Daten!D383)","v":2008},{"$f":"IF(ASV_Daten!E383=\"\",\"\",ASV_Daten!E383)","v":"w"},"8cw",13,"13w",null,null,null,null,null,null,null,null,null,null,false,"nix"]
[{"$f":"IF(ASV_Daten!A384=\"\",\"\",ASV_Daten!A384)","v":"8c"},{"$f":"IF(ASV_Daten!B384=\"\",\"\",ASV_Daten!B384)","v":"Thürbald"},{"$f":"IF(ASV_Daten!C384=\"\",\"\",ASV_Daten!C384)","v":"Kati"},{"$f":"IF(ASV_Daten!D384=\"\",\"\",ASV_Daten!D384)","v":2008},{"$f":"IF(ASV_Daten!E384=\"\",\"\",ASV_Daten!E384)","v":"w"},"8cw",13,"13w",null,null,null,null,null,null,null,null,null,null,false,"nix"]
[{"$f":"IF(ASV_Daten!A385=\"\",\"\",ASV_Daten!A385)","v":"8c"},{"$f":"IF(ASV_Daten!B385=\"\",\"\",ASV_Daten!B385)","v":"Kieth"},{"$f":"IF(ASV_Daten!C385=\"\",\"\",ASV_Daten!C385)","v":"Alfred"},{"$f":"IF(ASV_Daten!D385=\"\",\"\",ASV_Daten!D385)","v":2008},{"$f":"IF(ASV_Daten!E385=\"\",\"\",ASV_Daten!E385)","v":"m"},"8cm",13,"13m",null,null,null,null,null,null,null,null,null,null,false,"nix"]
[{"$f":"IF(ASV_Daten!A386=\"\",\"\",ASV_Daten!A386)","v":"8c"},{"$f":"IF(ASV_Daten!B386=\"\",\"\",ASV_Daten!B386)","v":"Müller"},{"$f":"IF(ASV_Daten!C386=\"\",\"\",ASV_Daten!C386)","v":"Anna"},{"$f":"IF(ASV_Daten!D386=\"\",\"\",ASV_Daten!D386)","v":2007},{"$f":"IF(ASV_Daten!E386=\"\",\"\",ASV_Daten!E386)","v":"w"},"8cw",14,"14w",null,null,null,null,null,null,null,null,null,null,false,"nix"]
[{"$f":"IF(ASV_Daten!A387=\"\",\"\",ASV_Daten!A387)","v":"8c"},{"$f":"IF(ASV_Daten!B387=\"\",\"\",ASV_Daten!B387)","v":"Brüning"},{"$f":"IF(ASV_Daten!C387=\"\",\"\",ASV_Daten!C387)","v":"Gustav"},{"$f":"IF(ASV_Daten!D387=\"\",\"\",ASV_Daten!D387)","v":2007},{"$f":"IF(ASV_Daten!E387=\"\",\"\",ASV_Daten!E387)","v":"m"},"8cm",14,"14m",null,null,null,null,null,null,null,null,null,null,false,"nix"]
[{"$f":"IF(ASV_Daten!A388=\"\",\"\",ASV_Daten!A388)","v":"8c"},{"$f":"IF(ASV_Daten!B388=\"\",\"\",ASV_Daten!B388)","v":"weber"},{"$f":"IF(ASV_Daten!C388=\"\",\"\",ASV_Daten!C388)","v":"Ferdinand"},{"$f":"IF(ASV_Daten!D388=\"\",\"\",ASV_Daten!D388)","v":2007},{"$f":"IF(ASV_Daten!E388=\"\",\"\",ASV_Daten!E388)","v":"m"},"8cm",14,"14m",null,null,null,null,null,null,null,null,null,null,false,"nix"]
[{"$f":"IF(ASV_Daten!A389=\"\",\"\",ASV_Daten!A389)","v":"8c"},{"$f":"IF(ASV_Daten!B389=\"\",\"\",ASV_Daten!B389)","v":"Müller"},{"$f":"IF(ASV_Daten!C389=\"\",\"\",ASV_Daten!C389)","v":"Lisa"},{"$f":"IF(ASV_Daten!D389=\"\",\"\",ASV_Daten!D389)","v":2007},{"$f":"IF(ASV_Daten!E389=\"\",\"\",ASV_Daten!E389)","v":"w"},"8cw",14,"14w",null,null,null,null,null,null,null,null,null,null,false,"nix"]
[{"$f":"IF(ASV_Daten!A390=\"\",\"\",ASV_Daten!A390)","v":"8c"},{"$f":"IF(ASV_Daten!B390=\"\",\"\",ASV_Daten!B390)","v":"Hartung"},{"$f":"IF(ASV_Daten!C390=\"\",\"\",ASV_Daten!C390)","v":"Ulla"},{"$f":"IF(ASV_Daten!D390=\"\",\"\",ASV_Daten!D390)","v":2007},{"$f":"IF(ASV_Daten!E390=\"\",\"\",ASV_Daten!E390)","v":"w"},"8cw",14,"14w",null,null,null,null,null,null,null,null,null,null,false,"nix"]
[{"$f":"IF(ASV_Daten!A391=\"\",\"\",ASV_Daten!A391)","v":"8c"},{"$f":"IF(ASV_Daten!B391=\"\",\"\",ASV_Daten!B391)","v":"Reichmann"},{"$f":"IF(ASV_Daten!C391=\"\",\"\",ASV_Daten!C391)","v":"Hanns"},{"$f":"IF(ASV_Daten!D391=\"\",\"\",ASV_Daten!D391)","v":2007},{"$f":"IF(ASV_Daten!E391=\"\",\"\",ASV_Daten!E391)","v":"m"},"8cm",14,"14m",null,null,null,null,null,null,null,null,null,null,false,"nix"]
[{"$f":"IF(ASV_Daten!A392=\"\",\"\",ASV_Daten!A392)","v":"8d"},{"$f":"IF(ASV_Daten!B392=\"\",\"\",ASV_Daten!B392)","v":"Busch"},{"$f":"IF(ASV_Daten!C392=\"\",\"\",ASV_Daten!C392)","v":"Jörg"},{"$f":"IF(ASV_Daten!D392=\"\",\"\",ASV_Daten!D392)","v":2008},{"$f":"IF(ASV_Daten!E392=\"\",\"\",ASV_Daten!E392)","v":"m"},"8dm",13,"13m",null,null,null,null,null,null,null,null,null,null,false,"nix"]
[{"$f":"IF(ASV_Daten!A393=\"\",\"\",ASV_Daten!A393)","v":"8d"},{"$f":"IF(ASV_Daten!B393=\"\",\"\",ASV_Daten!B393)","v":"Budig-Godolt"},{"$f":"IF(ASV_Daten!C393=\"\",\"\",ASV_Daten!C393)","v":"wolfgang"},{"$f":"IF(ASV_Daten!D393=\"\",\"\",ASV_Daten!D393)","v":2008},{"$f":"IF(ASV_Daten!E393=\"\",\"\",ASV_Daten!E393)","v":"m"},"8dm",13,"13m",null,null,null,null,null,null,null,null,null,null,false,"nix"]
[{"$f":"IF(ASV_Daten!A394=\"\",\"\",ASV_Daten!A394)","v":"8d"},{"$f":"IF(ASV_Daten!B394=\"\",\"\",ASV_Daten!B394)","v":"Hahn"},{"$f":"IF(ASV_Daten!C394=\"\",\"\",ASV_Daten!C394)","v":"Peter"},{"$f":"IF(ASV_Daten!D394=\"\",\"\",ASV_Daten!D394)","v":2007},{"$f":"IF(ASV_Daten!E394=\"\",\"\",ASV_Daten!E394)","v":"m"},"8dm",14,"14m",null,null,null,null,null,null,null,null,null,null,false,"nix"]
[{"$f":"IF(ASV_Daten!A395=\"\",\"\",ASV_Daten!A395)","v":"8d"},{"$f":"IF(ASV_Daten!B395=\"\",\"\",ASV_Daten!B395)","v":"Unbenannt"},{"$f":"IF(ASV_Daten!C395=\"\",\"\",ASV_Daten!C395)","v":"Ulf"},{"$f":"IF(ASV_Daten!D395=\"\",\"\",ASV_Daten!D395)","v":2007},{"$f":"IF(ASV_Daten!E395=\"\",\"\",ASV_Daten!E395)","v":"m"},"8dm",14,"14m",null,null,null,null,null,null,null,null,null,null,false,"nix"]
[{"$f":"IF(ASV_Daten!A396=\"\",\"\",ASV_Daten!A396)","v":"8d"},{"$f":"IF(ASV_Daten!B396=\"\",\"\",ASV_Daten!B396)","v":"Fregin"},{"$f":"IF(ASV_Daten!C396=\"\",\"\",ASV_Daten!C396)","v":"Erika"},{"$f":"IF(ASV_Daten!D396=\"\",\"\",ASV_Daten!D396)","v":2007},{"$f":"IF(ASV_Daten!E396=\"\",\"\",ASV_Daten!E396)","v":"w"},"8dw",14,"14w",null,null,null,null,null,null,null,null,null,null,false,"nix"]
[{"$f":"IF(ASV_Daten!A397=\"\",\"\",ASV_Daten!A397)","v":"8d"},{"$f":"IF(ASV_Daten!B397=\"\",\"\",ASV_Daten!B397)","v":"Dümchen"},{"$f":"IF(ASV_Daten!C397=\"\",\"\",ASV_Daten!C397)","v":"Peter"},{"$f":"IF(ASV_Daten!D397=\"\",\"\",ASV_Daten!D397)","v":2007},{"$f":"IF(ASV_Daten!E397=\"\",\"\",ASV_Daten!E397)","v":"m"},"8dm",14,"14m",null,null,null,null,null,null,null,null,null,null,false,"nix"]
[{"$f":"IF(ASV_Daten!A398=\"\",\"\",ASV_Daten!A398)","v":"8d"},{"$f":"IF(ASV_Daten!B398=\"\",\"\",ASV_Daten!B398)","v":"Buchmann-Rehmer"},{"$f":"IF(ASV_Daten!C398=\"\",\"\",ASV_Daten!C398)","v":"Kirsten"},{"$f":"IF(ASV_Daten!D398=\"\",\"\",ASV_Daten!D398)","v":2007},{"$f":"IF(ASV_Daten!E398=\"\",\"\",ASV_Daten!E398)","v":"w"},"8dw",14,"14w",null,null,null,null,null,null,null,null,null,null,false,"nix"]
[{"$f":"IF(ASV_Daten!A399=\"\",\"\",ASV_Daten!A399)","v":"8d"},{"$f":"IF(ASV_Daten!B399=\"\",\"\",ASV_Daten!B399)","v":"Brause"},{"$f":"IF(ASV_Daten!C399=\"\",\"\",ASV_Daten!C399)","v":"Cornelia"},{"$f":"IF(ASV_Daten!D399=\"\",\"\",ASV_Daten!D399)","v":2007},{"$f":"IF(ASV_Daten!E399=\"\",\"\",ASV_Daten!E399)","v":"w"},"8dw",14,"14w",null,null,null,null,null,null,null,null,null,null,false,"nix"]
[{"$f":"IF(ASV_Daten!A400=\"\",\"\",ASV_Daten!A400)","v":"8d"},{"$f":"IF(ASV_Daten!B400=\"\",\"\",ASV_Daten!B400)","v":"Brandt"},{"$f":"IF(ASV_Daten!C400=\"\",\"\",ASV_Daten!C400)","v":"Christine"},{"$f":"IF(ASV_Daten!D400=\"\",\"\",ASV_Daten!D400)","v":2008},{"$f":"IF(ASV_Daten!E400=\"\",\"\",ASV_Daten!E400)","v":"w"},"8dw",13,"13w",null,null,null,null,null,null,null,null,null,null,false,"nix"]
[{"$f":"IF(ASV_Daten!A401=\"\",\"\",ASV_Daten!A401)","v":"8d"},{"$f":"IF(ASV_Daten!B401=\"\",\"\",ASV_Daten!B401)","v":"Mair"},{"$f":"IF(ASV_Daten!C401=\"\",\"\",ASV_Daten!C401)","v":"Felix"},{"$f":"IF(ASV_Daten!D401=\"\",\"\",ASV_Daten!D401)","v":2008},{"$f":"IF(ASV_Daten!E401=\"\",\"\",ASV_Daten!E401)","v":"m"},"8dm",13,"13m",null,null,null,null,null,null,null,null,null,null,false,"nix"]
[{"$f":"IF(ASV_Daten!A402=\"\",\"\",ASV_Daten!A402)","v":"8d"},{"$f":"IF(ASV_Daten!B402=\"\",\"\",ASV_Daten!B402)","v":"Busch"},{"$f":"IF(ASV_Daten!C402=\"\",\"\",ASV_Daten!C402)","v":"Jörg"},{"$f":"IF(ASV_Daten!D402=\"\",\"\",ASV_Daten!D402)","v":2008},{"$f":"IF(ASV_Daten!E402=\"\",\"\",ASV_Daten!E402)","v":"m"},"8dm",13,"13m",null,null,null,null,null,null,null,null,null,null,false,"nix"]
[{"$f":"IF(ASV_Daten!A403=\"\",\"\",ASV_Daten!A403)","v":"8d"},{"$f":"IF(ASV_Daten!B403=\"\",\"\",ASV_Daten!B403)","v":"Budig-Godolt"},{"$f":"IF(ASV_Daten!C403=\"\",\"\",ASV_Daten!C403)","v":"wolfgang"},{"$f":"IF(ASV_Daten!D403=\"\",\"\",ASV_Daten!D403)","v":2008},{"$f":"IF(ASV_Daten!E403=\"\",\"\",ASV_Daten!E403)","v":"m"},"8dm",13,"13m",null,null,null,null,null,null,null,null,null,null,false,"nix"]
[{"$f":"IF(ASV_Daten!A404=\"\",\"\",ASV_Daten!A404)","v":"8d"},{"$f":"IF(ASV_Daten!B404=\"\",\"\",ASV_Daten!B404)","v":"Hahn"},{"$f":"IF(ASV_Daten!C404=\"\",\"\",ASV_Daten!C404)","v":"Peter"},{"$f":"IF(ASV_Daten!D404=\"\",\"\",ASV_Daten!D404)","v":2007},{"$f":"IF(ASV_Daten!E404=\"\",\"\",ASV_Daten!E404)","v":"m"},"8dm",14,"14m",null,null,null,null,null,null,null,null,null,null,{"$f":"IF(AND(A405=\"1a\",E405=\"m\"),\"N1m\",IF(AND(A405=\"1a\",E405=\"w\"),\"N1w\",IF(AND(A405=\"1b\",E405=\"w\"),\"N1w\",IF(AND(A405=\"1b\",E405=\"m\"),\"N1m\",IF(AND(A405=\"2a\",E405=\"m\"),\"N2m\",IF(AND(A405=\"2a\",E405=\"w\"),\"N2w\",IF(AND(A405=\"2b\",E405=\"w\"),\"N2w\",IF(AND(A405=\"2b\",E405=\"m\"),\"N2m\",IF(AND(A405=\"3a\",E405=\"m\"),\"N3m\",IF(AND(A405=\"3a\",E405=\"w\"),\"N3w\",IF(AND(A405=\"3b\",E405=\"w\"),\"N3w\",IF(AND(A405=\"3b\",E405=\"m\"),\"N3m\",IF(AND(A405=\"4a\",E405=\"m\"),\"N4m\",IF(AND(A405=\"4a\",E405=\"w\"),\"N4w\",IF(AND(A405=\"4b\",E405=\"m\"),\"N4m\",IF(AND(A405=\"4b\",E405=\"w\"),\"N4w\"))))))))))))))))","v":false},{"$f":"IF(S405=\"n1m\",VLOOKUP(Q405,N1m,2),IF(S405=\"N1w\",VLOOKUP(Q405,N1w,2),IF(S405=\"N2m\",VLOOKUP(Q405,n2m,2),IF(S405=\"N2w\",VLOOKUP(Q405,n2w,2),IF(S405=\"N3w\",VLOOKUP(Q405,n3w,2),IF(S405=\"N3m\",VLOOKUP(Q405,n3m,2),IF(S405=\"N4w\",VLOOKUP(Q405,n4w,2),IF(S405=\"N4m\",VLOOKUP(Q405,n4m,2),\"nix\"))))))))","v":"nix"}]
[{"$f":"IF(ASV_Daten!A405=\"\",\"\",ASV_Daten!A405)","v":"8d"},{"$f":"IF(ASV_Daten!B405=\"\",\"\",ASV_Daten!B405)","v":"Unbenannt"},{"$f":"IF(ASV_Daten!C405=\"\",\"\",ASV_Daten!C405)","v":"Ulf"},{"$f":"IF(ASV_Daten!D405=\"\",\"\",ASV_Daten!D405)","v":2007},{"$f":"IF(ASV_Daten!E405=\"\",\"\",ASV_Daten!E405)","v":"m"},"8dm",14,"14m",null,null,null,null,null,null,null,null,null,null,false,"nix"]
[{"$f":"IF(ASV_Daten!A406=\"\",\"\",ASV_Daten!A406)","v":"8d"},{"$f":"IF(ASV_Daten!B406=\"\",\"\",ASV_Daten!B406)","v":"Fregin"},{"$f":"IF(ASV_Daten!C406=\"\",\"\",ASV_Daten!C406)","v":"Erika"},{"$f":"IF(ASV_Daten!D406=\"\",\"\",ASV_Daten!D406)","v":2007},{"$f":"IF(ASV_Daten!E406=\"\",\"\",ASV_Daten!E406)","v":"w"},"8dw",14,"14w",null,null,null,null,null,null,null,null,null,null,false,"nix"]
[{"$f":"IF(ASV_Daten!A407=\"\",\"\",ASV_Daten!A407)","v":"8d"},{"$f":"IF(ASV_Daten!B407=\"\",\"\",ASV_Daten!B407)","v":"Dümchen"},{"$f":"IF(ASV_Daten!C407=\"\",\"\",ASV_Daten!C407)","v":"Peter"},{"$f":"IF(ASV_Daten!D407=\"\",\"\",ASV_Daten!D407)","v":2007},{"$f":"IF(ASV_Daten!E407=\"\",\"\",ASV_Daten!E407)","v":"m"},{"$f":"A408&E408","v":"8dm"},{"$f":"IF(D408=\"\",\"\",$B$1-$D408)","v":14},{"$f":"G408&E408","v":"14m"},null,null,null,null,null,null,null,null,null,null,false,"nix"]
[{"$f":"IF(ASV_Daten!A408=\"\",\"\",ASV_Daten!A408)","v":"8d"},{"$f":"IF(ASV_Daten!B408=\"\",\"\",ASV_Daten!B408)","v":"Buchmann-Rehmer"},{"$f":"IF(ASV_Daten!C408=\"\",\"\",ASV_Daten!C408)","v":"Kirsten"},{"$f":"IF(ASV_Daten!D408=\"\",\"\",ASV_Daten!D408)","v":2007},{"$f":"IF(ASV_Daten!E408=\"\",\"\",ASV_Daten!E408)","v":"w"},"8dw",14,"14w",null,null,null,null,null,null,null,null,null,null,false,"nix"]
[{"$f":"IF(ASV_Daten!A409=\"\",\"\",ASV_Daten!A409)","v":"8d"},{"$f":"IF(ASV_Daten!B409=\"\",\"\",ASV_Daten!B409)","v":"Brause"},{"$f":"IF(ASV_Daten!C409=\"\",\"\",ASV_Daten!C409)","v":"Cornelia"},{"$f":"IF(ASV_Daten!D409=\"\",\"\",ASV_Daten!D409)","v":2007},{"$f":"IF(ASV_Daten!E409=\"\",\"\",ASV_Daten!E409)","v":"w"},"8dw",14,"14w",null,null,null,null,null,null,null,null,null,null,false,"nix"]
[{"$f":"IF(ASV_Daten!A410=\"\",\"\",ASV_Daten!A410)","v":"8d"},{"$f":"IF(ASV_Daten!B410=\"\",\"\",ASV_Daten!B410)","v":"Brandt"},{"$f":"IF(ASV_Daten!C410=\"\",\"\",ASV_Daten!C410)","v":"Christine"},{"$f":"IF(ASV_Daten!D410=\"\",\"\",ASV_Daten!D410)","v":2008},{"$f":"IF(ASV_Daten!E410=\"\",\"\",ASV_Daten!E410)","v":"w"},"8dw",13,"13w",null,null,null,null,null,null,null,null,null,null,false,"nix"]
[{"$f":"IF(ASV_Daten!A411=\"\",\"\",ASV_Daten!A411)","v":"8d"},{"$f":"IF(ASV_Daten!B411=\"\",\"\",ASV_Daten!B411)","v":"Mair"},{"$f":"IF(ASV_Daten!C411=\"\",\"\",ASV_Daten!C411)","v":"Felix"},{"$f":"IF(ASV_Daten!D411=\"\",\"\",ASV_Daten!D411)","v":2008},{"$f":"IF(ASV_Daten!E411=\"\",\"\",ASV_Daten!E411)","v":"m"},"8dm",13,"13m",null,null,null,null,null,null,null,null,null,null,false,"nix"]
[{"$f":"IF(ASV_Daten!A412=\"\",\"\",ASV_Daten!A412)","v":"8d"},{"$f":"IF(ASV_Daten!B412=\"\",\"\",ASV_Daten!B412)","v":"Busch"},{"$f":"IF(ASV_Daten!C412=\"\",\"\",ASV_Daten!C412)","v":"Jörg"},{"$f":"IF(ASV_Daten!D412=\"\",\"\",ASV_Daten!D412)","v":2008},{"$f":"IF(ASV_Daten!E412=\"\",\"\",ASV_Daten!E412)","v":"m"},"8dm",13,"13m",null,null,null,null,null,null,null,null,null,null,false,"nix"]
[{"$f":"IF(ASV_Daten!A413=\"\",\"\",ASV_Daten!A413)","v":"8d"},{"$f":"IF(ASV_Daten!B413=\"\",\"\",ASV_Daten!B413)","v":"Budig-Godolt"},{"$f":"IF(ASV_Daten!C413=\"\",\"\",ASV_Daten!C413)","v":"wolfgang"},{"$f":"IF(ASV_Daten!D413=\"\",\"\",ASV_Daten!D413)","v":2008},{"$f":"IF(ASV_Daten!E413=\"\",\"\",ASV_Daten!E413)","v":"m"},"8dm",13,"13m",null,null,null,null,null,null,null,null,null,null,false,"nix"]
[{"$f":"IF(ASV_Daten!A414=\"\",\"\",ASV_Daten!A414)","v":"8d"},{"$f":"IF(ASV_Daten!B414=\"\",\"\",ASV_Daten!B414)","v":"Hahn"},{"$f":"IF(ASV_Daten!C414=\"\",\"\",ASV_Daten!C414)","v":"Peter"},{"$f":"IF(ASV_Daten!D414=\"\",\"\",ASV_Daten!D414)","v":2007},{"$f":"IF(ASV_Daten!E414=\"\",\"\",ASV_Daten!E414)","v":"m"},"8dm",14,"14m",null,null,null,null,null,null,null,null,null,null,false,"nix"]
[{"$f":"IF(ASV_Daten!A415=\"\",\"\",ASV_Daten!A415)","v":"8d"},{"$f":"IF(ASV_Daten!B415=\"\",\"\",ASV_Daten!B415)","v":"Unbenannt"},{"$f":"IF(ASV_Daten!C415=\"\",\"\",ASV_Daten!C415)","v":"Ulf"},{"$f":"IF(ASV_Daten!D415=\"\",\"\",ASV_Daten!D415)","v":2007},{"$f":"IF(ASV_Daten!E415=\"\",\"\",ASV_Daten!E415)","v":"m"},"8dm",14,"14m",null,null,null,null,null,null,null,null,null,null,false,"nix"]
[{"$f":"IF(ASV_Daten!A416=\"\",\"\",ASV_Daten!A416)","v":"8d"},{"$f":"IF(ASV_Daten!B416=\"\",\"\",ASV_Daten!B416)","v":"Fregin"},{"$f":"IF(ASV_Daten!C416=\"\",\"\",ASV_Daten!C416)","v":"Erika"},{"$f":"IF(ASV_Daten!D416=\"\",\"\",ASV_Daten!D416)","v":2007},{"$f":"IF(ASV_Daten!E416=\"\",\"\",ASV_Daten!E416)","v":"w"},"8dw",14,"14w",null,null,null,null,null,null,null,null,null,null,false,"nix"]
[{"$f":"IF(ASV_Daten!A417=\"\",\"\",ASV_Daten!A417)","v":"8d"},{"$f":"IF(ASV_Daten!B417=\"\",\"\",ASV_Daten!B417)","v":"Dümchen"},{"$f":"IF(ASV_Daten!C417=\"\",\"\",ASV_Daten!C417)","v":"Peter"},{"$f":"IF(ASV_Daten!D417=\"\",\"\",ASV_Daten!D417)","v":2007},{"$f":"IF(ASV_Daten!E417=\"\",\"\",ASV_Daten!E417)","v":"m"},"8dm",14,"14m",null,null,null,null,null,null,null,null,null,null,false,"nix"]
[{"$f":"IF(ASV_Daten!A418=\"\",\"\",ASV_Daten!A418)","v":"8d"},{"$f":"IF(ASV_Daten!B418=\"\",\"\",ASV_Daten!B418)","v":"Buchmann-Rehmer"},{"$f":"IF(ASV_Daten!C418=\"\",\"\",ASV_Daten!C418)","v":"Kirsten"},{"$f":"IF(ASV_Daten!D418=\"\",\"\",ASV_Daten!D418)","v":2007},{"$f":"IF(ASV_Daten!E418=\"\",\"\",ASV_Daten!E418)","v":"w"},"8dw",14,"14w",null,null,null,null,null,null,null,null,null,null,false,"nix"]
[{"$f":"IF(ASV_Daten!A419=\"\",\"\",ASV_Daten!A419)","v":"8d"},{"$f":"IF(ASV_Daten!B419=\"\",\"\",ASV_Daten!B419)","v":"Brause"},{"$f":"IF(ASV_Daten!C419=\"\",\"\",ASV_Daten!C419)","v":"Cornelia"},{"$f":"IF(ASV_Daten!D419=\"\",\"\",ASV_Daten!D419)","v":2007},{"$f":"IF(ASV_Daten!E419=\"\",\"\",ASV_Daten!E419)","v":"w"},"8dw",14,"14w",null,null,null,null,null,null,null,null,null,null,false,"nix"]
[{"$f":"IF(ASV_Daten!A420=\"\",\"\",ASV_Daten!A420)","v":"8d"},{"$f":"IF(ASV_Daten!B420=\"\",\"\",ASV_Daten!B420)","v":"Brandt"},{"$f":"IF(ASV_Daten!C420=\"\",\"\",ASV_Daten!C420)","v":"Christine"},{"$f":"IF(ASV_Daten!D420=\"\",\"\",ASV_Daten!D420)","v":2008},{"$f":"IF(ASV_Daten!E420=\"\",\"\",ASV_Daten!E420)","v":"w"},"8dw",13,"13w",null,null,null,null,null,null,null,null,null,null,false,"nix"]
[{"$f":"IF(ASV_Daten!A421=\"\",\"\",ASV_Daten!A421)","v":"8d"},{"$f":"IF(ASV_Daten!B421=\"\",\"\",ASV_Daten!B421)","v":"Mair"},{"$f":"IF(ASV_Daten!C421=\"\",\"\",ASV_Daten!C421)","v":"Felix"},{"$f":"IF(ASV_Daten!D421=\"\",\"\",ASV_Daten!D421)","v":2008},{"$f":"IF(ASV_Daten!E421=\"\",\"\",ASV_Daten!E421)","v":"m"},"8dm",13,"13m",null,null,null,null,null,null,null,null,null,null,false,"nix"]
[{"$f":"IF(ASV_Daten!A422=\"\",\"\",ASV_Daten!A422)","v":""},{"$f":"IF(ASV_Daten!B422=\"\",\"\",ASV_Daten!B422)","v":""},{"$f":"IF(ASV_Daten!C422=\"\",\"\",ASV_Daten!C422)","v":""},{"$f":"IF(ASV_Daten!D422=\"\",\"\",ASV_Daten!D422)","v":""},{"$f":"IF(ASV_Daten!E422=\"\",\"\",ASV_Daten!E422)","v":""},"","","",null,null,null,null,null,null,null,null,null,null,false,"nix"]
[{"$f":"IF(ASV_Daten!A423=\"\",\"\",ASV_Daten!A423)","v":""},{"$f":"IF(ASV_Daten!B423=\"\",\"\",ASV_Daten!B423)","v":""},{"$f":"IF(ASV_Daten!C423=\"\",\"\",ASV_Daten!C423)","v":""},{"$f":"IF(ASV_Daten!D423=\"\",\"\",ASV_Daten!D423)","v":""},{"$f":"IF(ASV_Daten!E423=\"\",\"\",ASV_Daten!E423)","v":""},"","","",null,null,null,null,null,null,null,null,null,null,false,"nix"]
[{"$f":"IF(ASV_Daten!A424=\"\",\"\",ASV_Daten!A424)","v":""},{"$f":"IF(ASV_Daten!B424=\"\",\"\",ASV_Daten!B424)","v":""},{"$f":"IF(ASV_Daten!C424=\"\",\"\",ASV_Daten!C424)","v":""},{"$f":"IF(ASV_Daten!D424=\"\",\"\",ASV_Daten!D424)","v":""},{"$f":"IF(ASV_Daten!E424=\"\",\"\",ASV_Daten!E424)","v":""},"","","",null,null,null,null,null,null,null,null,null,null,false,"nix"]
[{"$f":"IF(ASV_Daten!A425=\"\",\"\",ASV_Daten!A425)","v":""},{"$f":"IF(ASV_Daten!B425=\"\",\"\",ASV_Daten!B425)","v":""},{"$f":"IF(ASV_Daten!C425=\"\",\"\",ASV_Daten!C425)","v":""},{"$f":"IF(ASV_Daten!D425=\"\",\"\",ASV_Daten!D425)","v":""},{"$f":"IF(ASV_Daten!E425=\"\",\"\",ASV_Daten!E425)","v":""},"","","",null,null,null,null,null,null,null,null,null,null,false,"nix"]
[{"$f":"IF(ASV_Daten!A426=\"\",\"\",ASV_Daten!A426)","v":""},{"$f":"IF(ASV_Daten!B426=\"\",\"\",ASV_Daten!B426)","v":""},{"$f":"IF(ASV_Daten!C426=\"\",\"\",ASV_Daten!C426)","v":""},{"$f":"IF(ASV_Daten!D426=\"\",\"\",ASV_Daten!D426)","v":""},{"$f":"IF(ASV_Daten!E426=\"\",\"\",ASV_Daten!E426)","v":""},"","","",null,null,null,null,null,null,null,null,null,null,false,"nix"]
[{"$f":"IF(ASV_Daten!A427=\"\",\"\",ASV_Daten!A427)","v":""},{"$f":"IF(ASV_Daten!B427=\"\",\"\",ASV_Daten!B427)","v":""},{"$f":"IF(ASV_Daten!C427=\"\",\"\",ASV_Daten!C427)","v":""},{"$f":"IF(ASV_Daten!D427=\"\",\"\",ASV_Daten!D427)","v":""},{"$f":"IF(ASV_Daten!E427=\"\",\"\",ASV_Daten!E427)","v":""},"","","",null,null,null,null,null,null,null,null,null,null,false,"nix"]
[{"$f":"IF(ASV_Daten!A428=\"\",\"\",ASV_Daten!A428)","v":""},{"$f":"IF(ASV_Daten!B428=\"\",\"\",ASV_Daten!B428)","v":""},{"$f":"IF(ASV_Daten!C428=\"\",\"\",ASV_Daten!C428)","v":""},{"$f":"IF(ASV_Daten!D428=\"\",\"\",ASV_Daten!D428)","v":""},{"$f":"IF(ASV_Daten!E428=\"\",\"\",ASV_Daten!E428)","v":""},"","","",null,null,null,null,null,null,null,null,null,null,false,"nix"]
[{"$f":"IF(ASV_Daten!A429=\"\",\"\",ASV_Daten!A429)","v":""},{"$f":"IF(ASV_Daten!B429=\"\",\"\",ASV_Daten!B429)","v":""},{"$f":"IF(ASV_Daten!C429=\"\",\"\",ASV_Daten!C429)","v":""},{"$f":"IF(ASV_Daten!D429=\"\",\"\",ASV_Daten!D429)","v":""},{"$f":"IF(ASV_Daten!E429=\"\",\"\",ASV_Daten!E429)","v":""},"","","",null,null,null,null,null,null,null,null,null,null,false,"nix"]
[{"$f":"IF(ASV_Daten!A430=\"\",\"\",ASV_Daten!A430)","v":""},{"$f":"IF(ASV_Daten!B430=\"\",\"\",ASV_Daten!B430)","v":""},{"$f":"IF(ASV_Daten!C430=\"\",\"\",ASV_Daten!C430)","v":""},{"$f":"IF(ASV_Daten!D430=\"\",\"\",ASV_Daten!D430)","v":""},{"$f":"IF(ASV_Daten!E430=\"\",\"\",ASV_Daten!E430)","v":""},"","","",null,null,null,null,null,null,null,null,null,null,false,"nix"]
[{"$f":"IF(ASV_Daten!A431=\"\",\"\",ASV_Daten!A431)","v":""},{"$f":"IF(ASV_Daten!B431=\"\",\"\",ASV_Daten!B431)","v":""},{"$f":"IF(ASV_Daten!C431=\"\",\"\",ASV_Daten!C431)","v":""},{"$f":"IF(ASV_Daten!D431=\"\",\"\",ASV_Daten!D431)","v":""},{"$f":"IF(ASV_Daten!E431=\"\",\"\",ASV_Daten!E431)","v":""},"","","",null,null,null,null,null,null,null,null,null,null,false,"nix"]
[{"$f":"IF(ASV_Daten!A432=\"\",\"\",ASV_Daten!A432)","v":""},{"$f":"IF(ASV_Daten!B432=\"\",\"\",ASV_Daten!B432)","v":""},{"$f":"IF(ASV_Daten!C432=\"\",\"\",ASV_Daten!C432)","v":""},{"$f":"IF(ASV_Daten!D432=\"\",\"\",ASV_Daten!D432)","v":""},{"$f":"IF(ASV_Daten!E432=\"\",\"\",ASV_Daten!E432)","v":""},"","","",null,null,null,null,null,null,null,null,null,null,false,"nix"]
[{"$f":"IF(ASV_Daten!A433=\"\",\"\",ASV_Daten!A433)","v":""},{"$f":"IF(ASV_Daten!B433=\"\",\"\",ASV_Daten!B433)","v":""},{"$f":"IF(ASV_Daten!C433=\"\",\"\",ASV_Daten!C433)","v":""},{"$f":"IF(ASV_Daten!D433=\"\",\"\",ASV_Daten!D433)","v":""},{"$f":"IF(ASV_Daten!E433=\"\",\"\",ASV_Daten!E433)","v":""},"","","",null,null,null,null,null,null,null,null,null,null,false,"nix"]
[{"$f":"IF(ASV_Daten!A434=\"\",\"\",ASV_Daten!A434)","v":""},{"$f":"IF(ASV_Daten!B434=\"\",\"\",ASV_Daten!B434)","v":""},{"$f":"IF(ASV_Daten!C434=\"\",\"\",ASV_Daten!C434)","v":""},{"$f":"IF(ASV_Daten!D434=\"\",\"\",ASV_Daten!D434)","v":""},{"$f":"IF(ASV_Daten!E434=\"\",\"\",ASV_Daten!E434)","v":""},"","","",null,null,null,null,null,null,null,null,null,null,false,"nix"]
[{"$f":"IF(ASV_Daten!A435=\"\",\"\",ASV_Daten!A435)","v":""},{"$f":"IF(ASV_Daten!B435=\"\",\"\",ASV_Daten!B435)","v":""},{"$f":"IF(ASV_Daten!C435=\"\",\"\",ASV_Daten!C435)","v":""},{"$f":"IF(ASV_Daten!D435=\"\",\"\",ASV_Daten!D435)","v":""},{"$f":"IF(ASV_Daten!E435=\"\",\"\",ASV_Daten!E435)","v":""},"","","",null,null,null,null,null,null,null,null,null,null,false,"nix"]
[{"$f":"IF(ASV_Daten!A436=\"\",\"\",ASV_Daten!A436)","v":""},{"$f":"IF(ASV_Daten!B436=\"\",\"\",ASV_Daten!B436)","v":""},{"$f":"IF(ASV_Daten!C436=\"\",\"\",ASV_Daten!C436)","v":""},{"$f":"IF(ASV_Daten!D436=\"\",\"\",ASV_Daten!D436)","v":""},{"$f":"IF(ASV_Daten!E436=\"\",\"\",ASV_Daten!E436)","v":""},"","","",null,null,null,null,null,null,null,null,null,null,false,"nix"]
[{"$f":"IF(ASV_Daten!A437=\"\",\"\",ASV_Daten!A437)","v":""},{"$f":"IF(ASV_Daten!B437=\"\",\"\",ASV_Daten!B437)","v":""},{"$f":"IF(ASV_Daten!C437=\"\",\"\",ASV_Daten!C437)","v":""},{"$f":"IF(ASV_Daten!D437=\"\",\"\",ASV_Daten!D437)","v":""},{"$f":"IF(ASV_Daten!E437=\"\",\"\",ASV_Daten!E437)","v":""},"","","",null,null,null,null,null,null,null,null,null,null,false,"nix"]
[{"$f":"IF(ASV_Daten!A438=\"\",\"\",ASV_Daten!A438)","v":""},{"$f":"IF(ASV_Daten!B438=\"\",\"\",ASV_Daten!B438)","v":""},{"$f":"IF(ASV_Daten!C438=\"\",\"\",ASV_Daten!C438)","v":""},{"$f":"IF(ASV_Daten!D438=\"\",\"\",ASV_Daten!D438)","v":""},{"$f":"IF(ASV_Daten!E438=\"\",\"\",ASV_Daten!E438)","v":""},"","","",null,null,null,null,null,null,null,null,null,null,false,"nix"]
[{"$f":"IF(ASV_Daten!A439=\"\",\"\",ASV_Daten!A439)","v":""},{"$f":"IF(ASV_Daten!B439=\"\",\"\",ASV_Daten!B439)","v":""},{"$f":"IF(ASV_Daten!C439=\"\",\"\",ASV_Daten!C439)","v":""},{"$f":"IF(ASV_Daten!D439=\"\",\"\",ASV_Daten!D439)","v":""},{"$f":"IF(ASV_Daten!E439=\"\",\"\",ASV_Daten!E439)","v":""},"","","",null,null,null,null,null,null,null,null,null,null,false,"nix"]
[{"$f":"IF(ASV_Daten!A440=\"\",\"\",ASV_Daten!A440)","v":""},{"$f":"IF(ASV_Daten!B440=\"\",\"\",ASV_Daten!B440)","v":""},{"$f":"IF(ASV_Daten!C440=\"\",\"\",ASV_Daten!C440)","v":""},{"$f":"IF(ASV_Daten!D440=\"\",\"\",ASV_Daten!D440)","v":""},{"$f":"IF(ASV_Daten!E440=\"\",\"\",ASV_Daten!E440)","v":""},"","","",null,null,null,null,null,null,null,null,null,null,false,"nix"]
[{"$f":"IF(ASV_Daten!A441=\"\",\"\",ASV_Daten!A441)","v":""},{"$f":"IF(ASV_Daten!B441=\"\",\"\",ASV_Daten!B441)","v":""},{"$f":"IF(ASV_Daten!C441=\"\",\"\",ASV_Daten!C441)","v":""},{"$f":"IF(ASV_Daten!D441=\"\",\"\",ASV_Daten!D441)","v":""},{"$f":"IF(ASV_Daten!E441=\"\",\"\",ASV_Daten!E441)","v":""},"","","",null,null,null,null,null,null,null,null,null,null,false,"nix"]
[{"$f":"IF(ASV_Daten!A442=\"\",\"\",ASV_Daten!A442)","v":""},{"$f":"IF(ASV_Daten!B442=\"\",\"\",ASV_Daten!B442)","v":""},{"$f":"IF(ASV_Daten!C442=\"\",\"\",ASV_Daten!C442)","v":""},{"$f":"IF(ASV_Daten!D442=\"\",\"\",ASV_Daten!D442)","v":""},{"$f":"IF(ASV_Daten!E442=\"\",\"\",ASV_Daten!E442)","v":""},"","","",null,null,null,null,null,null,null,null,null,null,false,"nix"]
[{"$f":"IF(ASV_Daten!A443=\"\",\"\",ASV_Daten!A443)","v":""},{"$f":"IF(ASV_Daten!B443=\"\",\"\",ASV_Daten!B443)","v":""},{"$f":"IF(ASV_Daten!C443=\"\",\"\",ASV_Daten!C443)","v":""},{"$f":"IF(ASV_Daten!D443=\"\",\"\",ASV_Daten!D443)","v":""},{"$f":"IF(ASV_Daten!E443=\"\",\"\",ASV_Daten!E443)","v":""},"","","",null,null,null,null,null,null,null,null,null,null,false,"nix"]
[{"$f":"IF(ASV_Daten!A444=\"\",\"\",ASV_Daten!A444)","v":""},{"$f":"IF(ASV_Daten!B444=\"\",\"\",ASV_Daten!B444)","v":""},{"$f":"IF(ASV_Daten!C444=\"\",\"\",ASV_Daten!C444)","v":""},{"$f":"IF(ASV_Daten!D444=\"\",\"\",ASV_Daten!D444)","v":""},{"$f":"IF(ASV_Daten!E444=\"\",\"\",ASV_Daten!E444)","v":""},"","","",null,null,null,null,null,null,null,null,null,null,false,"nix"]
[{"$f":"IF(ASV_Daten!A445=\"\",\"\",ASV_Daten!A445)","v":""},{"$f":"IF(ASV_Daten!B445=\"\",\"\",ASV_Daten!B445)","v":""},{"$f":"IF(ASV_Daten!C445=\"\",\"\",ASV_Daten!C445)","v":""},{"$f":"IF(ASV_Daten!D445=\"\",\"\",ASV_Daten!D445)","v":""},{"$f":"IF(ASV_Daten!E445=\"\",\"\",ASV_Daten!E445)","v":""},"","","",null,null,null,null,null,null,null,null,null,null,false,"nix"]
[{"$f":"IF(ASV_Daten!A446=\"\",\"\",ASV_Daten!A446)","v":""},{"$f":"IF(ASV_Daten!B446=\"\",\"\",ASV_Daten!B446)","v":""},{"$f":"IF(ASV_Daten!C446=\"\",\"\",ASV_Daten!C446)","v":""},{"$f":"IF(ASV_Daten!D446=\"\",\"\",ASV_Daten!D446)","v":""},{"$f":"IF(ASV_Daten!E446=\"\",\"\",ASV_Daten!E446)","v":""},"","","",null,null,null,null,null,null,null,null,null,null,false,"nix"]
[{"$f":"IF(ASV_Daten!A447=\"\",\"\",ASV_Daten!A447)","v":""},{"$f":"IF(ASV_Daten!B447=\"\",\"\",ASV_Daten!B447)","v":""},{"$f":"IF(ASV_Daten!C447=\"\",\"\",ASV_Daten!C447)","v":""},{"$f":"IF(ASV_Daten!D447=\"\",\"\",ASV_Daten!D447)","v":""},{"$f":"IF(ASV_Daten!E447=\"\",\"\",ASV_Daten!E447)","v":""},"","","",null,null,null,null,null,null,null,null,null,null,false,"nix"]
[{"$f":"IF(ASV_Daten!A448=\"\",\"\",ASV_Daten!A448)","v":""},{"$f":"IF(ASV_Daten!B448=\"\",\"\",ASV_Daten!B448)","v":""},{"$f":"IF(ASV_Daten!C448=\"\",\"\",ASV_Daten!C448)","v":""},{"$f":"IF(ASV_Daten!D448=\"\",\"\",ASV_Daten!D448)","v":""},{"$f":"IF(ASV_Daten!E448=\"\",\"\",ASV_Daten!E448)","v":""},"","","",null,null,null,null,null,null,null,null,null,null,false,"nix"]
[{"$f":"IF(ASV_Daten!A449=\"\",\"\",ASV_Daten!A449)","v":""},{"$f":"IF(ASV_Daten!B449=\"\",\"\",ASV_Daten!B449)","v":""},{"$f":"IF(ASV_Daten!C449=\"\",\"\",ASV_Daten!C449)","v":""},{"$f":"IF(ASV_Daten!D449=\"\",\"\",ASV_Daten!D449)","v":""},{"$f":"IF(ASV_Daten!E449=\"\",\"\",ASV_Daten!E449)","v":""},"","","",null,null,null,null,null,null,null,null,null,null,false,"nix"]
[{"$f":"IF(ASV_Daten!A450=\"\",\"\",ASV_Daten!A450)","v":""},{"$f":"IF(ASV_Daten!B450=\"\",\"\",ASV_Daten!B450)","v":""},{"$f":"IF(ASV_Daten!C450=\"\",\"\",ASV_Daten!C450)","v":""},{"$f":"IF(ASV_Daten!D450=\"\",\"\",ASV_Daten!D450)","v":""},{"$f":"IF(ASV_Daten!E450=\"\",\"\",ASV_Daten!E450)","v":""},"","","",null,null,null,null,null,null,null,null,null,null,false,"nix"]
[{"$f":"IF(ASV_Daten!A451=\"\",\"\",ASV_Daten!A451)","v":""},{"$f":"IF(ASV_Daten!B451=\"\",\"\",ASV_Daten!B451)","v":""},{"$f":"IF(ASV_Daten!C451=\"\",\"\",ASV_Daten!C451)","v":""},{"$f":"IF(ASV_Daten!D451=\"\",\"\",ASV_Daten!D451)","v":""},{"$f":"IF(ASV_Daten!E451=\"\",\"\",ASV_Daten!E451)","v":""},"","","",null,null,null,null,null,null,null,null,null,null,false,"nix"]
[{"$f":"IF(ASV_Daten!A452=\"\",\"\",ASV_Daten!A452)","v":""},{"$f":"IF(ASV_Daten!B452=\"\",\"\",ASV_Daten!B452)","v":""},{"$f":"IF(ASV_Daten!C452=\"\",\"\",ASV_Daten!C452)","v":""},{"$f":"IF(ASV_Daten!D452=\"\",\"\",ASV_Daten!D452)","v":""},{"$f":"IF(ASV_Daten!E452=\"\",\"\",ASV_Daten!E452)","v":""},"","","",null,null,null,null,null,null,null,null,null,null,false,"nix"]
[{"$f":"IF(ASV_Daten!A453=\"\",\"\",ASV_Daten!A453)","v":""},{"$f":"IF(ASV_Daten!B453=\"\",\"\",ASV_Daten!B453)","v":""},{"$f":"IF(ASV_Daten!C453=\"\",\"\",ASV_Daten!C453)","v":""},{"$f":"IF(ASV_Daten!D453=\"\",\"\",ASV_Daten!D453)","v":""},{"$f":"IF(ASV_Daten!E453=\"\",\"\",ASV_Daten!E453)","v":""},"","","",null,null,null,null,null,null,null,null,null,null,false,"nix"]
[{"$f":"IF(ASV_Daten!A454=\"\",\"\",ASV_Daten!A454)","v":""},{"$f":"IF(ASV_Daten!B454=\"\",\"\",ASV_Daten!B454)","v":""},{"$f":"IF(ASV_Daten!C454=\"\",\"\",ASV_Daten!C454)","v":""},{"$f":"IF(ASV_Daten!D454=\"\",\"\",ASV_Daten!D454)","v":""},{"$f":"IF(ASV_Daten!E454=\"\",\"\",ASV_Daten!E454)","v":""},"","","",null,null,null,null,null,null,null,null,null,null,false,"nix"]
[{"$f":"IF(ASV_Daten!A455=\"\",\"\",ASV_Daten!A455)","v":""},{"$f":"IF(ASV_Daten!B455=\"\",\"\",ASV_Daten!B455)","v":""},{"$f":"IF(ASV_Daten!C455=\"\",\"\",ASV_Daten!C455)","v":""},{"$f":"IF(ASV_Daten!D455=\"\",\"\",ASV_Daten!D455)","v":""},{"$f":"IF(ASV_Daten!E455=\"\",\"\",ASV_Daten!E455)","v":""},"","","",null,null,null,null,null,null,null,null,null,null,false,"nix"]
[{"$f":"IF(ASV_Daten!A456=\"\",\"\",ASV_Daten!A456)","v":""},{"$f":"IF(ASV_Daten!B456=\"\",\"\",ASV_Daten!B456)","v":""},{"$f":"IF(ASV_Daten!C456=\"\",\"\",ASV_Daten!C456)","v":""},{"$f":"IF(ASV_Daten!D456=\"\",\"\",ASV_Daten!D456)","v":""},{"$f":"IF(ASV_Daten!E456=\"\",\"\",ASV_Daten!E456)","v":""},"","","",null,null,null,null,null,null,null,null,null,null,false,"nix"]
[{"$f":"IF(ASV_Daten!A457=\"\",\"\",ASV_Daten!A457)","v":""},{"$f":"IF(ASV_Daten!B457=\"\",\"\",ASV_Daten!B457)","v":""},{"$f":"IF(ASV_Daten!C457=\"\",\"\",ASV_Daten!C457)","v":""},{"$f":"IF(ASV_Daten!D457=\"\",\"\",ASV_Daten!D457)","v":""},{"$f":"IF(ASV_Daten!E457=\"\",\"\",ASV_Daten!E457)","v":""},"","","",null,null,null,null,null,null,null,null,null,null,false,"nix"]
[{"$f":"IF(ASV_Daten!A458=\"\",\"\",ASV_Daten!A458)","v":""},{"$f":"IF(ASV_Daten!B458=\"\",\"\",ASV_Daten!B458)","v":""},{"$f":"IF(ASV_Daten!C458=\"\",\"\",ASV_Daten!C458)","v":""},{"$f":"IF(ASV_Daten!D458=\"\",\"\",ASV_Daten!D458)","v":""},{"$f":"IF(ASV_Daten!E458=\"\",\"\",ASV_Daten!E458)","v":""},"","","",null,null,null,null,null,null,null,null,null,null,false,"nix"]
[{"$f":"IF(ASV_Daten!A459=\"\",\"\",ASV_Daten!A459)","v":""},{"$f":"IF(ASV_Daten!B459=\"\",\"\",ASV_Daten!B459)","v":""},{"$f":"IF(ASV_Daten!C459=\"\",\"\",ASV_Daten!C459)","v":""},{"$f":"IF(ASV_Daten!D459=\"\",\"\",ASV_Daten!D459)","v":""},{"$f":"IF(ASV_Daten!E459=\"\",\"\",ASV_Daten!E459)","v":""},"","","",null,null,null,null,null,null,null,null,null,null,false,"nix"]
[{"$f":"IF(ASV_Daten!A460=\"\",\"\",ASV_Daten!A460)","v":""},{"$f":"IF(ASV_Daten!B460=\"\",\"\",ASV_Daten!B460)","v":""},{"$f":"IF(ASV_Daten!C460=\"\",\"\",ASV_Daten!C460)","v":""},{"$f":"IF(ASV_Daten!D460=\"\",\"\",ASV_Daten!D460)","v":""},{"$f":"IF(ASV_Daten!E460=\"\",\"\",ASV_Daten!E460)","v":""},"","","",null,null,null,null,null,null,null,null,null,null,false,"nix"]
[{"$f":"IF(ASV_Daten!A461=\"\",\"\",ASV_Daten!A461)","v":""},{"$f":"IF(ASV_Daten!B461=\"\",\"\",ASV_Daten!B461)","v":""},{"$f":"IF(ASV_Daten!C461=\"\",\"\",ASV_Daten!C461)","v":""},{"$f":"IF(ASV_Daten!D461=\"\",\"\",ASV_Daten!D461)","v":""},{"$f":"IF(ASV_Daten!E461=\"\",\"\",ASV_Daten!E461)","v":""},"","","",null,null,null,null,null,null,null,null,null,null,false,"nix"]
[{"$f":"IF(ASV_Daten!A462=\"\",\"\",ASV_Daten!A462)","v":""},{"$f":"IF(ASV_Daten!B462=\"\",\"\",ASV_Daten!B462)","v":""},{"$f":"IF(ASV_Daten!C462=\"\",\"\",ASV_Daten!C462)","v":""},{"$f":"IF(ASV_Daten!D462=\"\",\"\",ASV_Daten!D462)","v":""},{"$f":"IF(ASV_Daten!E462=\"\",\"\",ASV_Daten!E462)","v":""},"","","",null,null,null,null,null,null,null,null,null,null,false,"nix"]
[{"$f":"IF(ASV_Daten!A463=\"\",\"\",ASV_Daten!A463)","v":""},{"$f":"IF(ASV_Daten!B463=\"\",\"\",ASV_Daten!B463)","v":""},{"$f":"IF(ASV_Daten!C463=\"\",\"\",ASV_Daten!C463)","v":""},{"$f":"IF(ASV_Daten!D463=\"\",\"\",ASV_Daten!D463)","v":""},{"$f":"IF(ASV_Daten!E463=\"\",\"\",ASV_Daten!E463)","v":""},"","","",null,null,null,null,null,null,null,null,null,null,false,"nix"]
[{"$f":"IF(ASV_Daten!A464=\"\",\"\",ASV_Daten!A464)","v":""},{"$f":"IF(ASV_Daten!B464=\"\",\"\",ASV_Daten!B464)","v":""},{"$f":"IF(ASV_Daten!C464=\"\",\"\",ASV_Daten!C464)","v":""},{"$f":"IF(ASV_Daten!D464=\"\",\"\",ASV_Daten!D464)","v":""},{"$f":"IF(ASV_Daten!E464=\"\",\"\",ASV_Daten!E464)","v":""},"","","",null,null,null,null,null,null,null,null,null,null,false,"nix"]
[{"$f":"IF(ASV_Daten!A465=\"\",\"\",ASV_Daten!A465)","v":""},{"$f":"IF(ASV_Daten!B465=\"\",\"\",ASV_Daten!B465)","v":""},{"$f":"IF(ASV_Daten!C465=\"\",\"\",ASV_Daten!C465)","v":""},{"$f":"IF(ASV_Daten!D465=\"\",\"\",ASV_Daten!D465)","v":""},{"$f":"IF(ASV_Daten!E465=\"\",\"\",ASV_Daten!E465)","v":""},"","","",null,null,null,null,null,null,null,null,null,null,false,"nix"]
[{"$f":"IF(ASV_Daten!A466=\"\",\"\",ASV_Daten!A466)","v":""},{"$f":"IF(ASV_Daten!B466=\"\",\"\",ASV_Daten!B466)","v":""},{"$f":"IF(ASV_Daten!C466=\"\",\"\",ASV_Daten!C466)","v":""},{"$f":"IF(ASV_Daten!D466=\"\",\"\",ASV_Daten!D466)","v":""},{"$f":"IF(ASV_Daten!E466=\"\",\"\",ASV_Daten!E466)","v":""},"","","",null,null,null,null,null,null,null,null,null,null,false,"nix"]
[{"$f":"IF(ASV_Daten!A467=\"\",\"\",ASV_Daten!A467)","v":""},{"$f":"IF(ASV_Daten!B467=\"\",\"\",ASV_Daten!B467)","v":""},{"$f":"IF(ASV_Daten!C467=\"\",\"\",ASV_Daten!C467)","v":""},{"$f":"IF(ASV_Daten!D467=\"\",\"\",ASV_Daten!D467)","v":""},{"$f":"IF(ASV_Daten!E467=\"\",\"\",ASV_Daten!E467)","v":""},"","","",null,null,null,null,null,null,null,null,null,null,false,"nix"]
[{"$f":"IF(ASV_Daten!A468=\"\",\"\",ASV_Daten!A468)","v":""},{"$f":"IF(ASV_Daten!B468=\"\",\"\",ASV_Daten!B468)","v":""},{"$f":"IF(ASV_Daten!C468=\"\",\"\",ASV_Daten!C468)","v":""},{"$f":"IF(ASV_Daten!D468=\"\",\"\",ASV_Daten!D468)","v":""},{"$f":"IF(ASV_Daten!E468=\"\",\"\",ASV_Daten!E468)","v":""},"","","",null,null,null,null,null,null,null,null,null,null,{"$f":"IF(AND(A469=\"1a\",E469=\"m\"),\"N1m\",IF(AND(A469=\"1a\",E469=\"w\"),\"N1w\",IF(AND(A469=\"1b\",E469=\"w\"),\"N1w\",IF(AND(A469=\"1b\",E469=\"m\"),\"N1m\",IF(AND(A469=\"2a\",E469=\"m\"),\"N2m\",IF(AND(A469=\"2a\",E469=\"w\"),\"N2w\",IF(AND(A469=\"2b\",E469=\"w\"),\"N2w\",IF(AND(A469=\"2b\",E469=\"m\"),\"N2m\",IF(AND(A469=\"3a\",E469=\"m\"),\"N3m\",IF(AND(A469=\"3a\",E469=\"w\"),\"N3w\",IF(AND(A469=\"3b\",E469=\"w\"),\"N3w\",IF(AND(A469=\"3b\",E469=\"m\"),\"N3m\",IF(AND(A469=\"4a\",E469=\"m\"),\"N4m\",IF(AND(A469=\"4a\",E469=\"w\"),\"N4w\",IF(AND(A469=\"4b\",E469=\"m\"),\"N4m\",IF(AND(A469=\"4b\",E469=\"w\"),\"N4w\"))))))))))))))))","v":false},{"$f":"IF(S469=\"n1m\",VLOOKUP(Q469,N1m,2),IF(S469=\"N1w\",VLOOKUP(Q469,N1w,2),IF(S469=\"N2m\",VLOOKUP(Q469,n2m,2),IF(S469=\"N2w\",VLOOKUP(Q469,n2w,2),IF(S469=\"N3w\",VLOOKUP(Q469,n3w,2),IF(S469=\"N3m\",VLOOKUP(Q469,n3m,2),IF(S469=\"N4w\",VLOOKUP(Q469,n4w,2),IF(S469=\"N4m\",VLOOKUP(Q469,n4m,2),\"nix\"))))))))","v":"nix"}]
[{"$f":"IF(ASV_Daten!A469=\"\",\"\",ASV_Daten!A469)","v":""},{"$f":"IF(ASV_Daten!B469=\"\",\"\",ASV_Daten!B469)","v":""},{"$f":"IF(ASV_Daten!C469=\"\",\"\",ASV_Daten!C469)","v":""},{"$f":"IF(ASV_Daten!D469=\"\",\"\",ASV_Daten!D469)","v":""},{"$f":"IF(ASV_Daten!E469=\"\",\"\",ASV_Daten!E469)","v":""},"","","",null,null,null,null,null,null,null,null,null,null,false,"nix"]
[{"$f":"IF(ASV_Daten!A470=\"\",\"\",ASV_Daten!A470)","v":""},{"$f":"IF(ASV_Daten!B470=\"\",\"\",ASV_Daten!B470)","v":""},{"$f":"IF(ASV_Daten!C470=\"\",\"\",ASV_Daten!C470)","v":""},{"$f":"IF(ASV_Daten!D470=\"\",\"\",ASV_Daten!D470)","v":""},{"$f":"IF(ASV_Daten!E470=\"\",\"\",ASV_Daten!E470)","v":""},"","","",null,null,null,null,null,null,null,null,null,null,false,"nix"]
[{"$f":"IF(ASV_Daten!A471=\"\",\"\",ASV_Daten!A471)","v":""},{"$f":"IF(ASV_Daten!B471=\"\",\"\",ASV_Daten!B471)","v":""},{"$f":"IF(ASV_Daten!C471=\"\",\"\",ASV_Daten!C471)","v":""},{"$f":"IF(ASV_Daten!D471=\"\",\"\",ASV_Daten!D471)","v":""},{"$f":"IF(ASV_Daten!E471=\"\",\"\",ASV_Daten!E471)","v":""},{"$f":"A472&E472","v":""},{"$f":"IF(D472=\"\",\"\",$B$1-$D472)","v":""},{"$f":"G472&E472","v":""},null,null,null,null,null,null,null,null,null,null,false,"nix"]
[{"$f":"IF(ASV_Daten!A472=\"\",\"\",ASV_Daten!A472)","v":""},{"$f":"IF(ASV_Daten!B472=\"\",\"\",ASV_Daten!B472)","v":""},{"$f":"IF(ASV_Daten!C472=\"\",\"\",ASV_Daten!C472)","v":""},{"$f":"IF(ASV_Daten!D472=\"\",\"\",ASV_Daten!D472)","v":""},{"$f":"IF(ASV_Daten!E472=\"\",\"\",ASV_Daten!E472)","v":""},"","","",null,null,null,null,null,null,null,null,null,null,false,"nix"]
[{"$f":"IF(ASV_Daten!A473=\"\",\"\",ASV_Daten!A473)","v":""},{"$f":"IF(ASV_Daten!B473=\"\",\"\",ASV_Daten!B473)","v":""},{"$f":"IF(ASV_Daten!C473=\"\",\"\",ASV_Daten!C473)","v":""},{"$f":"IF(ASV_Daten!D473=\"\",\"\",ASV_Daten!D473)","v":""},{"$f":"IF(ASV_Daten!E473=\"\",\"\",ASV_Daten!E473)","v":""},"","","",null,null,null,null,null,null,null,null,null,null,false,"nix"]
[{"$f":"IF(ASV_Daten!A474=\"\",\"\",ASV_Daten!A474)","v":""},{"$f":"IF(ASV_Daten!B474=\"\",\"\",ASV_Daten!B474)","v":""},{"$f":"IF(ASV_Daten!C474=\"\",\"\",ASV_Daten!C474)","v":""},{"$f":"IF(ASV_Daten!D474=\"\",\"\",ASV_Daten!D474)","v":""},{"$f":"IF(ASV_Daten!E474=\"\",\"\",ASV_Daten!E474)","v":""},"","","",null,null,null,null,null,null,null,null,null,null,false,"nix"]
[{"$f":"IF(ASV_Daten!A475=\"\",\"\",ASV_Daten!A475)","v":""},{"$f":"IF(ASV_Daten!B475=\"\",\"\",ASV_Daten!B475)","v":""},{"$f":"IF(ASV_Daten!C475=\"\",\"\",ASV_Daten!C475)","v":""},{"$f":"IF(ASV_Daten!D475=\"\",\"\",ASV_Daten!D475)","v":""},{"$f":"IF(ASV_Daten!E475=\"\",\"\",ASV_Daten!E475)","v":""},"","","",null,null,null,null,null,null,null,null,null,null,false,"nix"]
[{"$f":"IF(ASV_Daten!A476=\"\",\"\",ASV_Daten!A476)","v":""},{"$f":"IF(ASV_Daten!B476=\"\",\"\",ASV_Daten!B476)","v":""},{"$f":"IF(ASV_Daten!C476=\"\",\"\",ASV_Daten!C476)","v":""},{"$f":"IF(ASV_Daten!D476=\"\",\"\",ASV_Daten!D476)","v":""},{"$f":"IF(ASV_Daten!E476=\"\",\"\",ASV_Daten!E476)","v":""},"","","",null,null,null,null,null,null,null,null,null,null,false,"nix"]
[{"$f":"IF(ASV_Daten!A477=\"\",\"\",ASV_Daten!A477)","v":""},{"$f":"IF(ASV_Daten!B477=\"\",\"\",ASV_Daten!B477)","v":""},{"$f":"IF(ASV_Daten!C477=\"\",\"\",ASV_Daten!C477)","v":""},{"$f":"IF(ASV_Daten!D477=\"\",\"\",ASV_Daten!D477)","v":""},{"$f":"IF(ASV_Daten!E477=\"\",\"\",ASV_Daten!E477)","v":""},"","","",null,null,null,null,null,null,null,null,null,null,false,"nix"]
[{"$f":"IF(ASV_Daten!A478=\"\",\"\",ASV_Daten!A478)","v":""},{"$f":"IF(ASV_Daten!B478=\"\",\"\",ASV_Daten!B478)","v":""},{"$f":"IF(ASV_Daten!C478=\"\",\"\",ASV_Daten!C478)","v":""},{"$f":"IF(ASV_Daten!D478=\"\",\"\",ASV_Daten!D478)","v":""},{"$f":"IF(ASV_Daten!E478=\"\",\"\",ASV_Daten!E478)","v":""},"","","",null,null,null,null,null,null,null,null,null,null,false,"nix"]
[{"$f":"IF(ASV_Daten!A479=\"\",\"\",ASV_Daten!A479)","v":""},{"$f":"IF(ASV_Daten!B479=\"\",\"\",ASV_Daten!B479)","v":""},{"$f":"IF(ASV_Daten!C479=\"\",\"\",ASV_Daten!C479)","v":""},{"$f":"IF(ASV_Daten!D479=\"\",\"\",ASV_Daten!D479)","v":""},{"$f":"IF(ASV_Daten!E479=\"\",\"\",ASV_Daten!E479)","v":""},"","","",null,null,null,null,null,null,null,null,null,null,false,"nix"]
[{"$f":"IF(ASV_Daten!A480=\"\",\"\",ASV_Daten!A480)","v":""},{"$f":"IF(ASV_Daten!B480=\"\",\"\",ASV_Daten!B480)","v":""},{"$f":"IF(ASV_Daten!C480=\"\",\"\",ASV_Daten!C480)","v":""},{"$f":"IF(ASV_Daten!D480=\"\",\"\",ASV_Daten!D480)","v":""},{"$f":"IF(ASV_Daten!E480=\"\",\"\",ASV_Daten!E480)","v":""},"","","",null,null,null,null,null,null,null,null,null,null,false,"nix"]
[{"$f":"IF(ASV_Daten!A481=\"\",\"\",ASV_Daten!A481)","v":""},{"$f":"IF(ASV_Daten!B481=\"\",\"\",ASV_Daten!B481)","v":""},{"$f":"IF(ASV_Daten!C481=\"\",\"\",ASV_Daten!C481)","v":""},{"$f":"IF(ASV_Daten!D481=\"\",\"\",ASV_Daten!D481)","v":""},{"$f":"IF(ASV_Daten!E481=\"\",\"\",ASV_Daten!E481)","v":""},"","","",null,null,null,null,null,null,null,null,null,null,false,"nix"]
[{"$f":"IF(ASV_Daten!A482=\"\",\"\",ASV_Daten!A482)","v":""},{"$f":"IF(ASV_Daten!B482=\"\",\"\",ASV_Daten!B482)","v":""},{"$f":"IF(ASV_Daten!C482=\"\",\"\",ASV_Daten!C482)","v":""},{"$f":"IF(ASV_Daten!D482=\"\",\"\",ASV_Daten!D482)","v":""},{"$f":"IF(ASV_Daten!E482=\"\",\"\",ASV_Daten!E482)","v":""},"","","",null,null,null,null,null,null,null,null,null,null,false,"nix"]
[{"$f":"IF(ASV_Daten!A483=\"\",\"\",ASV_Daten!A483)","v":""},{"$f":"IF(ASV_Daten!B483=\"\",\"\",ASV_Daten!B483)","v":""},{"$f":"IF(ASV_Daten!C483=\"\",\"\",ASV_Daten!C483)","v":""},{"$f":"IF(ASV_Daten!D483=\"\",\"\",ASV_Daten!D483)","v":""},{"$f":"IF(ASV_Daten!E483=\"\",\"\",ASV_Daten!E483)","v":""},"","","",null,null,null,null,null,null,null,null,null,null,false,"nix"]
[{"$f":"IF(ASV_Daten!A484=\"\",\"\",ASV_Daten!A484)","v":""},{"$f":"IF(ASV_Daten!B484=\"\",\"\",ASV_Daten!B484)","v":""},{"$f":"IF(ASV_Daten!C484=\"\",\"\",ASV_Daten!C484)","v":""},{"$f":"IF(ASV_Daten!D484=\"\",\"\",ASV_Daten!D484)","v":""},{"$f":"IF(ASV_Daten!E484=\"\",\"\",ASV_Daten!E484)","v":""},"","","",null,null,null,null,null,null,null,null,null,null,false,"nix"]
[{"$f":"IF(ASV_Daten!A485=\"\",\"\",ASV_Daten!A485)","v":""},{"$f":"IF(ASV_Daten!B485=\"\",\"\",ASV_Daten!B485)","v":""},{"$f":"IF(ASV_Daten!C485=\"\",\"\",ASV_Daten!C485)","v":""},{"$f":"IF(ASV_Daten!D485=\"\",\"\",ASV_Daten!D485)","v":""},{"$f":"IF(ASV_Daten!E485=\"\",\"\",ASV_Daten!E485)","v":""},"","","",null,null,null,null,null,null,null,null,null,null,false,"nix"]
[{"$f":"IF(ASV_Daten!A486=\"\",\"\",ASV_Daten!A486)","v":""},{"$f":"IF(ASV_Daten!B486=\"\",\"\",ASV_Daten!B486)","v":""},{"$f":"IF(ASV_Daten!C486=\"\",\"\",ASV_Daten!C486)","v":""},{"$f":"IF(ASV_Daten!D486=\"\",\"\",ASV_Daten!D486)","v":""},{"$f":"IF(ASV_Daten!E486=\"\",\"\",ASV_Daten!E486)","v":""},"","","",null,null,null,null,null,null,null,null,null,null,false,"nix"]
[{"$f":"IF(ASV_Daten!A487=\"\",\"\",ASV_Daten!A487)","v":""},{"$f":"IF(ASV_Daten!B487=\"\",\"\",ASV_Daten!B487)","v":""},{"$f":"IF(ASV_Daten!C487=\"\",\"\",ASV_Daten!C487)","v":""},{"$f":"IF(ASV_Daten!D487=\"\",\"\",ASV_Daten!D487)","v":""},{"$f":"IF(ASV_Daten!E487=\"\",\"\",ASV_Daten!E487)","v":""},"","","",null,null,null,null,null,null,null,null,null,null,false,"nix"]
[{"$f":"IF(ASV_Daten!A488=\"\",\"\",ASV_Daten!A488)","v":""},{"$f":"IF(ASV_Daten!B488=\"\",\"\",ASV_Daten!B488)","v":""},{"$f":"IF(ASV_Daten!C488=\"\",\"\",ASV_Daten!C488)","v":""},{"$f":"IF(ASV_Daten!D488=\"\",\"\",ASV_Daten!D488)","v":""},{"$f":"IF(ASV_Daten!E488=\"\",\"\",ASV_Daten!E488)","v":""},"","","",null,null,null,null,null,null,null,null,null,null,false,"nix"]
[{"$f":"IF(ASV_Daten!A489=\"\",\"\",ASV_Daten!A489)","v":""},{"$f":"IF(ASV_Daten!B489=\"\",\"\",ASV_Daten!B489)","v":""},{"$f":"IF(ASV_Daten!C489=\"\",\"\",ASV_Daten!C489)","v":""},{"$f":"IF(ASV_Daten!D489=\"\",\"\",ASV_Daten!D489)","v":""},{"$f":"IF(ASV_Daten!E489=\"\",\"\",ASV_Daten!E489)","v":""},"","","",null,null,null,null,null,null,null,null,null,null,false,"nix"]
[{"$f":"IF(ASV_Daten!A490=\"\",\"\",ASV_Daten!A490)","v":""},{"$f":"IF(ASV_Daten!B490=\"\",\"\",ASV_Daten!B490)","v":""},{"$f":"IF(ASV_Daten!C490=\"\",\"\",ASV_Daten!C490)","v":""},{"$f":"IF(ASV_Daten!D490=\"\",\"\",ASV_Daten!D490)","v":""},{"$f":"IF(ASV_Daten!E490=\"\",\"\",ASV_Daten!E490)","v":""},"","","",null,null,null,null,null,null,null,null,null,null,false,"nix"]
[{"$f":"IF(ASV_Daten!A491=\"\",\"\",ASV_Daten!A491)","v":""},{"$f":"IF(ASV_Daten!B491=\"\",\"\",ASV_Daten!B491)","v":""},{"$f":"IF(ASV_Daten!C491=\"\",\"\",ASV_Daten!C491)","v":""},{"$f":"IF(ASV_Daten!D491=\"\",\"\",ASV_Daten!D491)","v":""},{"$f":"IF(ASV_Daten!E491=\"\",\"\",ASV_Daten!E491)","v":""},"","","",null,null,null,null,null,null,null,null,null,null,false,"nix"]
[{"$f":"IF(ASV_Daten!A492=\"\",\"\",ASV_Daten!A492)","v":""},{"$f":"IF(ASV_Daten!B492=\"\",\"\",ASV_Daten!B492)","v":""},{"$f":"IF(ASV_Daten!C492=\"\",\"\",ASV_Daten!C492)","v":""},{"$f":"IF(ASV_Daten!D492=\"\",\"\",ASV_Daten!D492)","v":""},{"$f":"IF(ASV_Daten!E492=\"\",\"\",ASV_Daten!E492)","v":""},"","","",null,null,null,null,null,null,null,null,null,null,false,"nix"]
[{"$f":"IF(ASV_Daten!A493=\"\",\"\",ASV_Daten!A493)","v":""},{"$f":"IF(ASV_Daten!B493=\"\",\"\",ASV_Daten!B493)","v":""},{"$f":"IF(ASV_Daten!C493=\"\",\"\",ASV_Daten!C493)","v":""},{"$f":"IF(ASV_Daten!D493=\"\",\"\",ASV_Daten!D493)","v":""},{"$f":"IF(ASV_Daten!E493=\"\",\"\",ASV_Daten!E493)","v":""},"","","",null,null,null,null,null,null,null,null,null,null,false,"nix"]
[{"$f":"IF(ASV_Daten!A494=\"\",\"\",ASV_Daten!A494)","v":""},{"$f":"IF(ASV_Daten!B494=\"\",\"\",ASV_Daten!B494)","v":""},{"$f":"IF(ASV_Daten!C494=\"\",\"\",ASV_Daten!C494)","v":""},{"$f":"IF(ASV_Daten!D494=\"\",\"\",ASV_Daten!D494)","v":""},{"$f":"IF(ASV_Daten!E494=\"\",\"\",ASV_Daten!E494)","v":""},"","","",null,null,null,null,null,null,null,null,null,null,false,"nix"]
[{"$f":"IF(ASV_Daten!A495=\"\",\"\",ASV_Daten!A495)","v":""},{"$f":"IF(ASV_Daten!B495=\"\",\"\",ASV_Daten!B495)","v":""},{"$f":"IF(ASV_Daten!C495=\"\",\"\",ASV_Daten!C495)","v":""},{"$f":"IF(ASV_Daten!D495=\"\",\"\",ASV_Daten!D495)","v":""},{"$f":"IF(ASV_Daten!E495=\"\",\"\",ASV_Daten!E495)","v":""},"","","",null,null,null,null,null,null,null,null,null,null,false,"nix"]
[{"$f":"IF(ASV_Daten!A496=\"\",\"\",ASV_Daten!A496)","v":""},{"$f":"IF(ASV_Daten!B496=\"\",\"\",ASV_Daten!B496)","v":""},{"$f":"IF(ASV_Daten!C496=\"\",\"\",ASV_Daten!C496)","v":""},{"$f":"IF(ASV_Daten!D496=\"\",\"\",ASV_Daten!D496)","v":""},{"$f":"IF(ASV_Daten!E496=\"\",\"\",ASV_Daten!E496)","v":""},"","","",null,null,null,null,null,null,null,null,null,null,false,"nix"]
[{"$f":"IF(ASV_Daten!A497=\"\",\"\",ASV_Daten!A497)","v":""},{"$f":"IF(ASV_Daten!B497=\"\",\"\",ASV_Daten!B497)","v":""},{"$f":"IF(ASV_Daten!C497=\"\",\"\",ASV_Daten!C497)","v":""},{"$f":"IF(ASV_Daten!D497=\"\",\"\",ASV_Daten!D497)","v":""},{"$f":"IF(ASV_Daten!E497=\"\",\"\",ASV_Daten!E497)","v":""},"","","",null,null,null,null,null,null,null,null,null,null,false,"nix"]
[{"$f":"IF(ASV_Daten!A498=\"\",\"\",ASV_Daten!A498)","v":""},{"$f":"IF(ASV_Daten!B498=\"\",\"\",ASV_Daten!B498)","v":""},{"$f":"IF(ASV_Daten!C498=\"\",\"\",ASV_Daten!C498)","v":""},{"$f":"IF(ASV_Daten!D498=\"\",\"\",ASV_Daten!D498)","v":""},{"$f":"IF(ASV_Daten!E498=\"\",\"\",ASV_Daten!E498)","v":""},"","","",null,null,null,null,null,null,null,null,null,null,false,"nix"]
[{"$f":"IF(ASV_Daten!A499=\"\",\"\",ASV_Daten!A499)","v":""},{"$f":"IF(ASV_Daten!B499=\"\",\"\",ASV_Daten!B499)","v":""},{"$f":"IF(ASV_Daten!C499=\"\",\"\",ASV_Daten!C499)","v":""},{"$f":"IF(ASV_Daten!D499=\"\",\"\",ASV_Daten!D499)","v":""},{"$f":"IF(ASV_Daten!E499=\"\",\"\",ASV_Daten!E499)","v":""},"","","",null,null,null,null,null,null,null,null,null,null,false,"nix"]
[{"$f":"IF(ASV_Daten!A500=\"\",\"\",ASV_Daten!A500)","v":""},{"$f":"IF(ASV_Daten!B500=\"\",\"\",ASV_Daten!B500)","v":""},{"$f":"IF(ASV_Daten!C500=\"\",\"\",ASV_Daten!C500)","v":""},{"$f":"IF(ASV_Daten!D500=\"\",\"\",ASV_Daten!D500)","v":""},{"$f":"IF(ASV_Daten!E500=\"\",\"\",ASV_Daten!E500)","v":""},"","","",null,null,null,null,null,null,null,null,null,null,false,"nix"]
[{"$f":"IF(ASV_Daten!A501=\"\",\"\",ASV_Daten!A501)","v":""},{"$f":"IF(ASV_Daten!B501=\"\",\"\",ASV_Daten!B501)","v":""},{"$f":"IF(ASV_Daten!C501=\"\",\"\",ASV_Daten!C501)","v":""},{"$f":"IF(ASV_Daten!D501=\"\",\"\",ASV_Daten!D501)","v":""},{"$f":"IF(ASV_Daten!E501=\"\",\"\",ASV_Daten!E501)","v":""},"","","",null,null,null,null,null,null,null,null,null,null,false,"nix"]
[{"$f":"IF(ASV_Daten!A502=\"\",\"\",ASV_Daten!A502)","v":""},{"$f":"IF(ASV_Daten!B502=\"\",\"\",ASV_Daten!B502)","v":""},{"$f":"IF(ASV_Daten!C502=\"\",\"\",ASV_Daten!C502)","v":""},{"$f":"IF(ASV_Daten!D502=\"\",\"\",ASV_Daten!D502)","v":""},{"$f":"IF(ASV_Daten!E502=\"\",\"\",ASV_Daten!E502)","v":""},"","","",null,null,null,null,null,null,null,null,null,null,false,"nix"]

{"sheet":"Punkte_Matrix","index":1,"n_rows":34,"n_cols":5,"rows_kept":34,"cut":false,"hidden":false,"merged":[]}
[]
["Punkte","8w",null,"Punkte","8m"]
[0,"H",null,0,"H"]
[1,"T",null,1,"T"]
[475,"S",null,450,"S"]
[625,"E",null,575,"E"]
[]
[]
["Punkte","9w",null,"Punkte","9m"]
[0,"H",null,0,"H"]
[1,"T",null,1,"T"]
[550,"S",null,525,"S"]
[725,"E",null,675,"E"]
[]
[]
["Punkte","10w",null,"Punkte","10m"]
[0,"H",null,0,"H"]
[1,"T",null,1,"T"]
[625,"S",null,600,"S"]
[825,"E",null,775,"E"]
[]
[]
["Punkte","11w",null,"Punkte","11m"]
[0,"H",null,0,"H"]
[1,"T",null,1,"T"]
[700,"S",null,675,"S"]
[900,"E",null,875,"E"]
[]
[]
["Punkte","12w",null,"Punkte","12m"]
[0,"H",null,0,"H"]
[1,"T",null,1,"T"]
[775,"S",null,750,"S"]
[975,"E",null,975,"E"]

{"sheet":"Noten_Matrix","index":2,"n_rows":26,"n_cols":5,"rows_kept":26,"cut":false,"hidden":false,"merged":[]}
["Punkte","n1w",null,"Punkte","n1m"]
[0,4,null,0,4]
[250,3,null,225,3]
[400,2,null,350,2]
[500,1,null,475,1]
[]
[]
["Punkte","n2w",null,"Punkte","n2m"]
[0,4,null,0,4]
[400,3,null,375,3]
[475,2,null,450,2]
[625,1,null,575,1]
[]
[]
["Punkte","n3w",null,"Punkte","n3m"]
[0,4,null,0,4]
[475,3,null,450,3]
[550,2,null,525,2]
[725,1,null,675,1]
[]
[]
["Punkte","n4w",null,"Punkte","n4m"]
[0,4,null,0,4]
[{"$f":"A26*0.7","v":577.5},3,null,{"$f":"D26*0.7","v":542.5},3]
[625,2,null,600,2]
[825,1,null,775,1]

{"sheet":"ASV_Daten","index":3,"n_rows":421,"n_cols":8,"rows_kept":421,"cut":false,"hidden":false,"merged":[]}
["Klasse","Name","Vorname","Geburtsjahr","Geschl",null,"Klassen","Zahl"]
["5a","Alaba","David",2011,"m",null,"5a",{"$f":"COUNTIF($A$2:$A$421,G2)","v":28}]
["5a","Belkahia","Semi",2010,"m",null,"5b",{"$f":"COUNTIF($A$2:$A$421,G3)","v":29}]
["5a","Dressel","Dennis",2011,"m",null,"5c",21]
["5a","Djajo","Johann",2011,"m",null,"5d",25]
["5a","Hiller","Marco",2011,"m",null,"6a",26]
["5a","Lex","Stefan",2010,"m",null,"6b",24]
["5a","Mölders ","Sascha",2011,"m",null,"6c",27]
["5a","Tallig","Erik",2011,"m",null,"6d",30]
["5a","Belkner","Jerome",2010,"m",null,"7a",27]
["5a","Zeppelin","Leni",2011,"w",null,"7b",27]
["5a","Kallote","Marus",2011,"m",null,"7c",24]
["5a","Alaba","David",2011,"m",null,"7d",27]
["5a","Dressel","Dennis",2011,"m",null,"8a",24]
["5a","Djajo","Johann",2011,"m",null,"8b",24]
["5a","Hiller","Marco",2011,"m",null,"8c",27]
["5a","Lex","Stefan",2010,"m",null,"8d",30]
["5a","Mölders ","Sascha",2011,"m",null,null,{"$f":"SUM(H2:H17)","v":420}]
["5a","Tallig","Erik",2011,"m"]
["5a","Zeppelin","Leni",2011,"w"]
["5a","Kallote","Marus",2011,"m"]
["5a","Alaba","David",2011,"m"]
["5a","Belkahia","Semi",2010,"m"]
["5a","Dressel","Dennis",2011,"m"]
["5a","Djajo","Johann",2011,"m"]
["5a","Hiller","Marco",2011,"m"]
["5a","Lex","Stefan",2010,"m"]
["5a","Mölders ","Sascha",2011,"m"]
["5a","Tallig","Erik",2011,"m"]
["5b","Belkner","Jerome",2010,"m"]
["5b","Belkahia","Semi",2010,"m"]
["5b","Belkner","Jerome",2010,"m"]
["5b","Zeppelin","Leni",2011,"w"]
["5b","Kallote","Marus",2011,"m"]
["5b","Hund","Kurt",2010,"m"]
["5b","Penara","Horst",2010,"m"]
["5b","Rieser","Jennifer",2010,"w"]
["5b","Schoning","Daniela",2010,"w"]
["5b","Grimmig","Karola",2010,"w"]
["5b","Jordu","Jaja",2010,"w"]
["5b","Erdmann","Denise",2011,"w"]
["5b","Greilinger","Fabienne",2010,"w"]
["5b","Hund","Kurt",2010,"m"]
["5b","Penara","Horst",2010,"m"]
["5b","Rieser","Jennifer",2010,"w"]
["5b","Schoning","Daniela",2010,"w"]
["5b","Grimmig","Karola",2010,"w"]
["5b","Jordu","Jaja",2010,"w"]
["5b","Erdmann","Denise",2011,"w"]
["5b","Greilinger","Fabienne",2010,"w"]
["5b","Hund","Kurt",2010,"m"]
["5b","Penara","Horst",2010,"m"]
["5b","Rieser","Jennifer",2010,"w"]
["5b","Schoning","Daniela",2010,"w"]
["5b","Grimmig","Karola",2010,"w"]
["5b","Jordu","Jaja",2010,"w"]
["5b","Erdmann","Denise",2011,"w"]
["5b","Greilinger","Fabienne",2010,"w"]
["5c","Klassen","Leonie",2010,"w"]
["5c","Moll","Quirinia",2011,"w"]
["5c","Salger","Stephanie",2011,"w"]
["5c","Steinhart","Philippa",2011,"w"]
["5c","wein","Daniela",2011,"w"]
["5c","willsch","Maria",2011,"w"]
["5c","woodstock","Neele",2011,"w"]
["5c","Klassen","Leonie",2010,"w"]
["5c","Moll","Quirinia",2011,"w"]
["5c","Salger","Stephanie",2011,"w"]
["5c","Steinhart","Philippa",2011,"w"]
["5c","wein","Daniela",2011,"w"]
["5c","willsch","Maria",2011,"w"]
["5c","woodstock","Neele",2011,"w"]
["5c","Klassen","Leonie",2010,"w"]
["5c","Moll","Quirinia",2011,"w"]
["5c","Salger","Stephanie",2011,"w"]
["5c","Steinhart","Philippa",2011,"w"]
["5c","wein","Daniela",2011,"w"]
["5c","willsch","Maria",2011,"w"]
["5c","woodstock","Neele",2011,"w"]
["5d","Adler","Marja",2011,"w"]
["5d","Jannowski","Sonja",2011,"w"]
["5d","Lowsano","Simon",2011,"m"]
["5d","Pretlow","Janus",2011,"m"]
["5d","Schibar","Mara",2011,"w"]
["5d","Schulze","Anjoschka",2011,"w"]
["5d","wlodomar","Hermann",2011,"m"]
["5d","Birkus","Yvo",2011,"m"]
["5d","Adler","Marja",2011,"w"]
["5d","Jannowski","Sonja",2011,"w"]
["5d","Lowsano","Simon",2011,"m"]
["5d","Pretlow","Janus",2011,"m"]
["5d","Schibar","Mara",2011,"w"]
["5d","Schulze","Anjoschka",2011,"w"]
["5d","wlodomar","Hermann",2011,"m"]
["5d","Birkus","Yvo",2011,"m"]
["5d","Adler","Marja",2011,"w"]
["5d","Jannowski","Sonja",2011,"w"]
["5d","Lowsano","Simon",2011,"m"]
["5d","Pretlow","Janus",2011,"m"]
["5d","Schibar","Mara",2011,"w"]
["5d","Schulze","Anjoschka",2011,"w"]
["5d","wlodomar","Hermann",2011,"m"]
["5d","Birkus","Yvo",2011,"m"]
["5d","Echems","Alexander",2011,"m"]
["6a","Paustik","Tanja",2009,"w"]
["6a","Struwe","Bert",2009,"m"]
["6a","Langwasser","Yvo",2009,"m"]
["6a","Schöbel","Uwe",2009,"m"]
["6a","Schrüll","Sigbert",2009,"m"]
["6a","Klim","Christian",2009,"m"]
["6a","Schlup","Alexander",2009,"m"]
["6a","weber","Katharina",2011,"w"]
["6a","Echems","Alexander",2011,"m"]
["6a","Paustik","Tanja",2009,"w"]
["6a","Struwe","Bert",2009,"m"]
["6a","Langwasser","Yvo",2009,"m"]
["6a","Schöbel","Uwe",2009,"m"]
["6a","Schrüll","Sigbert",2009,"m"]
["6a","Klim","Christian",2009,"m"]
["6a","Schlup","Alexander",2009,"m"]
["6a","weber","Katharina",2011,"w"]
["6a","Echems","Alexander",2011,"m"]
["6a","Paustik","Tanja",2009,"w"]
["6a","Struwe","Bert",2009,"m"]
["6a","Langwasser","Yvo",2009,"m"]
["6a","Schöbel","Uwe",2009,"m"]
["6a","Schrüll","Sigbert",2009,"m"]
["6a","Klim","Christian",2009,"m"]
["6a","Schlup","Alexander",2009,"m"]
["6a","weber","Katharina",2011,"w"]
["6b","Becker              ","Jonas",2010,"m"]
["6b","Becker              ","Jutta",2010,"w"]
["6b","Gerlach             ","Peter",2010,"m"]
["6b","Herold              ","Karin",2010,"w"]
["6b","Herbst              ","Sandra",2009,"w"]
["6b","König               ","Gabriele",2009,"w"]
["6b","Löwe                ","Jutta",2009,"w"]
["6b","Lachner             ","Thomas",2009,"m"]
["6b","Becker              ","Jonas",2010,"m"]
["6b","Becker              ","Jutta",2010,"w"]
["6b","Gerlach             ","Peter",2010,"m"]
["6b","Herold              ","Karin",2010,"w"]
["6b","Herbst              ","Sandra",2009,"w"]
["6b","König               ","Gabriele",2009,"w"]
["6b","Löwe                ","Jutta",2009,"w"]
["6b","Lachner             ","Thomas",2009,"m"]
["6b","Becker              ","Jonas",2010,"m"]
["6b","Becker              ","Jutta",2010,"w"]
["6b","Gerlach             ","Peter",2010,"m"]
["6b","Herold              ","Karin",2010,"w"]
["6b","Herbst              ","Sandra",2009,"w"]
["6b","König               ","Gabriele",2009,"w"]
["6b","Löwe                ","Jutta",2009,"w"]
["6b","Lachner             ","Thomas",2009,"m"]
["6c","Bäter","Stella",2011,"w"]
["6c","Brüssing","Philipp",2011,"m"]
["6c","Rollas","Gerd",2011,"m"]
["6c","Gerlach","Siegfried",2011,"m"]
["6c","Althaus             ","Christa",2009,"w"]
["6c","Alt                 ","Julia",2009,"w"]
["6c","Andersen            ","Thomas",2009,"m"]
["6c","Becker              ","Carola",2009,"w"]
["6c","Beck                ","Franz",2009,"m"]
["6c","Bäter","Stella",2011,"w"]
["6c","Brüssing","Philipp",2011,"m"]
["6c","Rollas","Gerd",2011,"m"]
["6c","Gerlach","Siegfried",2011,"m"]
["6c","Althaus             ","Christa",2009,"w"]
["6c","Alt                 ","Julia",2009,"w"]
["6c","Andersen            ","Thomas",2009,"m"]
["6c","Becker              ","Carola",2009,"w"]
["6c","Beck                ","Franz",2009,"m"]
["6c","Bäter","Stella",2011,"w"]
["6c","Brüssing","Philipp",2011,"m"]
["6c","Rollas","Gerd",2011,"m"]
["6c","Gerlach","Siegfried",2011,"m"]
["6c","Althaus             ","Christa",2009,"w"]
["6c","Alt                 ","Julia",2009,"w"]
["6c","Andersen            ","Thomas",2009,"m"]
["6c","Becker              ","Carola",2009,"w"]
["6c","Beck                ","Franz",2009,"m"]
["6d","Meyer               ","Jutta",2009,"w"]
["6d","Müller              ","Tanja",2009,"w"]
["6d","Meisner             ","wilfried",2010,"m"]
["6d","Petersen            ","Günter",2010,"m"]
["6d","Pilowski            ","Heike",2010,"w"]
["6d","Pausch              ","Jens",2010,"m"]
["6d","Schösser            ","Bernd",2010,"m"]
["6d","Schmidt             ","Karl",2009,"m"]
["6d","Schützer            ","Ulf",2009,"m"]
["6d","Tönje               ","Christoph",2009,"m"]
["6d","Meyer               ","Jutta",2009,"w"]
["6d","Müller              ","Tanja",2009,"w"]
["6d","Meisner             ","wilfried",2010,"m"]
["6d","Petersen            ","Günter",2010,"m"]
["6d","Pilowski            ","Heike",2010,"w"]
["6d","Pausch              ","Jens",2010,"m"]
["6d","Schösser            ","Bernd",2010,"m"]
["6d","Schmidt             ","Karl",2009,"m"]
["6d","Schützer            ","Ulf",2009,"m"]
["6d","Tönje               ","Christoph",2009,"m"]
["6d","Meyer               ","Jutta",2009,"w"]
["6d","Müller              ","Tanja",2009,"w"]
["6d","Meisner             ","wilfried",2010,"m"]
["6d","Petersen            ","Günter",2010,"m"]
["6d","Pilowski            ","Heike",2010,"w"]
["6d","Pausch              ","Jens",2010,"m"]
["6d","Schösser            ","Bernd",2010,"m"]
["6d","Schmidt             ","Karl",2009,"m"]
["6d","Schützer            ","Ulf",2009,"m"]
["6d","Tönje               ","Christoph",2009,"m"]
["7a","Zeug                ","Konrad",2009,"m"]
["7a","weiss","Hannes",2009,"m"]
["7a","Berger","Franz",2009,"m"]
["7a","Schwarz","Albert",2009,"w"]
["7a","Herrmann","Petra",2009,"m"]
["7a","Huber","Maximilian",2009,"w"]
["7a","Meier","Helga",2009,"w"]
["7a","Dorfmeister","Sabine",2009,"m"]
["7a","Mayr","Herbert",2009,"m"]
["7a","Zeug                ","Konrad",2009,"m"]
["7a","weiss","Hannes",2009,"m"]
["7a","Berger","Franz",2009,"m"]
["7a","Schwarz","Albert",2009,"w"]
["7a","Herrmann","Petra",2009,"m"]
["7a","Huber","Maximilian",2009,"w"]
["7a","Meier","Helga",2009,"w"]
["7a","Dorfmeister","Sabine",2009,"m"]
["7a","Mayr","Herbert",2009,"m"]
["7a","Zeug                ","Konrad",2009,"m"]
["7a","weiss","Hannes",2009,"m"]
["7a","Berger","Franz",2009,"m"]
["7a","Schwarz","Albert",2009,"w"]
["7a","Herrmann","Petra",2009,"m"]
["7a","Huber","Maximilian",2009,"w"]
["7a","Meier","Helga",2009,"w"]
["7a","Dorfmeister","Sabine",2009,"m"]
["7a","Mayr","Herbert",2009,"m"]
["7b","Lindner","Christian",2008,"m"]
["7b","Siener","Nadja",2008,"w"]
["7b","Lang","Marianne",2008,"w"]
["7b","Strasser","Kurt",2009,"m"]
["7b","Reiter","Friedrich",2009,"m"]
["7b","Kellner","Susanne",2009,"w"]
["7b","Koch","Christine",2009,"w"]
["7b","Stein","Markus",2009,"m"]
["7b","Mayr","Sigrid",2009,"w"]
["7b","Lindner","Christian",2008,"m"]
["7b","Siener","Nadja",2008,"w"]
["7b","Lang","Marianne",2008,"w"]
["7b","Strasser","Kurt",2009,"m"]
["7b","Reiter","Friedrich",2009,"m"]
["7b","Kellner","Susanne",2009,"w"]
["7b","Koch","Christine",2009,"w"]
["7b","Stein","Markus",2009,"m"]
["7b","Mayr","Sigrid",2009,"w"]
["7b","Lindner","Christian",2008,"m"]
["7b","Siener","Nadja",2008,"w"]
["7b","Lang","Marianne",2008,"w"]
["7b","Strasser","Kurt",2009,"m"]
["7b","Reiter","Friedrich",2009,"m"]
["7b","Kellner","Susanne",2009,"w"]
["7b","Koch","Christine",2009,"w"]
["7b","Stein","Markus",2009,"m"]
["7b","Mayr","Sigrid",2009,"w"]
["7c","Schwarz","Daniel",2009,"m"]
["7c","Hauser","Hans",2008,"m"]
["7c","Gruber","Manfred",2008,"m"]
["7c","wagner","Eva",2008,"w"]
["7c","Böck","Veronika",2008,"w"]
["7c","Freiberg","Sigrid",2008,"w"]
["7c","Lustig","Maria",2008,"w"]
["7c","Freud","Sebastian",2008,"m"]
["7c","Schwarz","Daniel",2009,"m"]
["7c","Hauser","Hans",2008,"m"]
["7c","Gruber","Manfred",2008,"m"]
["7c","wagner","Eva",2008,"w"]
["7c","Böck","Veronika",2008,"w"]
["7c","Freiberg","Sigrid",2008,"w"]
["7c","Lustig","Maria",2008,"w"]
["7c","Freud","Sebastian",2008,"m"]
["7c","Schwarz","Daniel",2009,"m"]
["7c","Hauser","Hans",2008,"m"]
["7c","Gruber","Manfred",2008,"m"]
["7c","wagner","Eva",2008,"w"]
["7c","Böck","Veronika",2008,"w"]
["7c","Freiberg","Sigrid",2008,"w"]
["7c","Lustig","Maria",2008,"w"]
["7c","Freud","Sebastian",2008,"m"]
["7d","Branniger","Clarissa",2008,"w"]
["7d","Birkus","Yvo",2008,"w"]
["7d","wlodomar","Hermann",2008,"m"]
["7d","Armbrecht","Mark",2008,"m"]
["7d","Adler","Marja",2009,"w"]
["7d","Pretlow","Janus",2009,"m"]
["7d","webel","Manfred",2009,"m"]
["7d","Dröfborn","Marik",2009,"m"]
["7d","Dziabu","Üsgül",2009,"w"]
["7d","Branniger","Clarissa",2008,"w"]
["7d","Birkus","Yvo",2008,"w"]
["7d","wlodomar","Hermann",2008,"m"]
["7d","Armbrecht","Mark",2008,"m"]
["7d","Adler","Marja",2009,"w"]
["7d","Pretlow","Janus",2009,"m"]
["7d","webel","Manfred",2009,"m"]
["7d","Dröfborn","Marik",2009,"m"]
["7d","Dziabu","Üsgül",2009,"w"]
["7d","Branniger","Clarissa",2008,"w"]
["7d","Birkus","Yvo",2008,"w"]
["7d","wlodomar","Hermann",2008,"m"]
["7d","Armbrecht","Mark",2008,"m"]
["7d","Adler","Marja",2009,"w"]
["7d","Pretlow","Janus",2009,"m"]
["7d","webel","Manfred",2009,"m"]
["7d","Dröfborn","Marik",2009,"m"]
["7d","Dziabu","Üsgül",2009,"w"]
["8a","Demar","Pascal",2007,"m"]
["8a","Eckelor","Nic",2007,"m"]
["8a","Büchmar","Nicole",2007,"w"]
["8a","Bladdow","Tin",2007,"m"]
["8a","Böklar","Urs",2007,"m"]
["8a","Krejsel","Carola",2007,"w"]
["8a","Kruwa","Lutz",2007,"m"]
["8a","Rittkopf","Ursel",2008,"w"]
["8a","Demar","Pascal",2007,"m"]
["8a","Eckelor","Nic",2007,"m"]
["8a","Büchmar","Nicole",2007,"w"]
["8a","Bladdow","Tin",2007,"m"]
["8a","Böklar","Urs",2007,"m"]
["8a","Krejsel","Carola",2007,"w"]
["8a","Kruwa","Lutz",2007,"m"]
["8a","Rittkopf","Ursel",2008,"w"]
["8a","Demar","Pascal",2007,"m"]
["8a","Eckelor","Nic",2007,"m"]
["8a","Büchmar","Nicole",2007,"w"]
["8a","Bladdow","Tin",2007,"m"]
["8a","Böklar","Urs",2007,"m"]
["8a","Krejsel","Carola",2007,"w"]
["8a","Kruwa","Lutz",2007,"m"]
["8a","Rittkopf","Ursel",2008,"w"]
["8b","Desczyk","Margot",2007,"w"]
["8b","Meyer","Franziska",2007,"w"]
["8b","Kuhner ","Miriam",2008,"w"]
["8b","Luban","Ludwig",2008,"m"]
["8b","Redmann","Georg",2008,"m"]
["8b","Scheunemann","Sybille",2008,"w"]
["8b","Hoffemann","Ute",2008,"w"]
["8b","Hahnemann","Ursula",2008,"w"]
["8b","Desczyk","Margot",2007,"w"]
["8b","Meyer","Franziska",2007,"w"]
["8b","Kuhner ","Miriam",2008,"w"]
["8b","Luban","Ludwig",2008,"m"]
["8b","Redmann","Georg",2008,"m"]
["8b","Scheunemann","Sybille",2008,"w"]
["8b","Hoffemann","Ute",2008,"w"]
["8b","Hahnemann","Ursula",2008,"w"]
["8b","Desczyk","Margot",2007,"w"]
["8b","Meyer","Franziska",2007,"w"]
["8b","Kuhner ","Miriam",2008,"w"]
["8b","Luban","Ludwig",2008,"m"]
["8b","Redmann","Georg",2008,"m"]
["8b","Scheunemann","Sybille",2008,"w"]
["8b","Hoffemann","Ute",2008,"w"]
["8b","Hahnemann","Ursula",2008,"w"]
["8c","Rieser","Jennifer",2008,"w"]
["8c","Thürbald","Kati",2008,"w"]
["8c","Kieth","Alfred",2008,"m"]
["8c","Müller","Anna",2007,"w"]
["8c","Brüning","Gustav",2007,"m"]
["8c","weber","Ferdinand",2007,"m"]
["8c","Müller","Lisa",2007,"w"]
["8c","Hartung","Ulla",2007,"w"]
["8c","Reichmann","Hanns",2007,"m"]
["8c","Rieser","Jennifer",2008,"w"]
["8c","Thürbald","Kati",2008,"w"]
["8c","Kieth","Alfred",2008,"m"]
["8c","Müller","Anna",2007,"w"]
["8c","Brüning","Gustav",2007,"m"]
["8c","weber","Ferdinand",2007,"m"]
["8c","Müller","Lisa",2007,"w"]
["8c","Hartung","Ulla",2007,"w"]
["8c","Reichmann","Hanns",2007,"m"]
["8c","Rieser","Jennifer",2008,"w"]
["8c","Thürbald","Kati",2008,"w"]
["8c","Kieth","Alfred",2008,"m"]
["8c","Müller","Anna",2007,"w"]
["8c","Brüning","Gustav",2007,"m"]
["8c","weber","Ferdinand",2007,"m"]
["8c","Müller","Lisa",2007,"w"]
["8c","Hartung","Ulla",2007,"w"]
["8c","Reichmann","Hanns",2007,"m"]
["8d","Busch","Jörg",2008,"m"]
["8d","Budig-Godolt","wolfgang",2008,"m"]
["8d","Hahn","Peter",2007,"m"]
["8d","Unbenannt","Ulf",2007,"m"]
["8d","Fregin","Erika",2007,"w"]
["8d","Dümchen","Peter",2007,"m"]
["8d","Buchmann-Rehmer","Kirsten",2007,"w"]
["8d","Brause","Cornelia",2007,"w"]
["8d","Brandt","Christine",2008,"w"]
["8d","Mair","Felix",2008,"m"]
["8d","Busch","Jörg",2008,"m"]
["8d","Budig-Godolt","wolfgang",2008,"m"]
["8d","Hahn","Peter",2007,"m"]
["8d","Unbenannt","Ulf",2007,"m"]
["8d","Fregin","Erika",2007,"w"]
["8d","Dümchen","Peter",2007,"m"]
["8d","Buchmann-Rehmer","Kirsten",2007,"w"]
["8d","Brause","Cornelia",2007,"w"]
["8d","Brandt","Christine",2008,"w"]
["8d","Mair","Felix",2008,"m"]
["8d","Busch","Jörg",2008,"m"]
["8d","Budig-Godolt","wolfgang",2008,"m"]
["8d","Hahn","Peter",2007,"m"]
["8d","Unbenannt","Ulf",2007,"m"]
["8d","Fregin","Erika",2007,"w"]
["8d","Dümchen","Peter",2007,"m"]
["8d","Buchmann-Rehmer","Kirsten",2007,"w"]
["8d","Brause","Cornelia",2007,"w"]
["8d","Brandt","Christine",2008,"w"]
["8d","Mair","Felix",2008,"m"]

{"sheet":"Formeln","index":4,"n_rows":16,"n_cols":6,"rows_kept":16,"cut":false,"hidden":false,"merged":[[0,2,0,6]]}
[null,null,"Formeln"]
[]
[null,"8w","WENN(k2=0;0;WENN(k2<475;\"T\";WENN(k2<625;\"S\";WENN(k2>624;\"E\"))))"]
[null,"9w","WENN(K3=0;0;WENN(K3<550;\"T\";WENN(K3<725;\"S\";WENN(K3>724;\"E\"))))"]
[null,"10w","WENN(K4=0;0;WENN(K4<625;\"T\";WENN(K4<825;\"S\";WENN(K4>824;\"E\"))))"]
[null,"11w","WENN(K4=0;0;WENN(K4<700;\"T\";WENN(K4<900;\"S\";WENN(K4>899;\"E\"))))"]
[null,"12w","WENN(B7=0;0;WENN(B7<775;\"T\";WENN(B7<975;\"S\";WENN(B7>974;\"E\"))))"]
[null,"8m","WENN(K2=0;0;WENN(K2<450;\"T\";WENN(K2<575;\"S\";WENN(K2>574;\"E\"))))"]
[null,"9m","WENN(K7=0;0;WENN(K7<525;\"T\";WENN(K7<675;\"S\";WENN(K7>674;\"E\"))))"]
[null,"10m","WENN(K8=0;0;WENN(K8<600;\"T\";WENN(K8<775;\"S\";WENN(K8>774;\"E\"))))"]
[null,"11m","WENN(K8=0;0;WENN(K8<675;\"T\";WENN(K8<875;\"S\";WENN(K8>874;\"E\"))))"]
[null,"12m","WENN(K8=0;0;WENN(K8<750;\"T\";WENN(K8<975;\"S\";WENN(K8>974;\"E\"))))"]
[]
[null,null,"Ausdauer","Sprint","Sprung","Wurf"]
[null,"w","(((800/(g3))-2,0232)/0,00647)","(((50/(12,38+0,24))-3,648)/0,0066)","((WURZEL(A15)-1,0935)/0,00208)","((WURZEL(B15)-2,0232)/0,00874)"]
[null,"m","(((1000/G5)-2,158)/0,006)","(((50/(12,38+0,24))-3,79)/0,0069)","((WURZEL(A16)-1,15028)/0,00219)","((WURZEL(B16)-2,8)/0,011)"]

{"sheet":"Ausgangstabelle","index":5,"n_rows":500,"n_cols":13,"rows_kept":500,"cut":false,"hidden":false,"merged":[[1,1,3,4],[1,5,1,12],[2,7,3,9],[2,10,3,12]]}
[null,"Wettkampfliste 2022",null,null,null,null,null,null,null,null,null,"Kl"]
[null,"Leichtathletik",null,null,null,"Disziplin"]
[null,null,null,null,null,"Ausdauer","Sprint","Weitsprung",null,null,"Wurf"]
[null,null,null,null,null,"800 m","50 m"]
[0,"Name","Vorname","Kl.","Alter","Leistung","Leistung","1. V.","2. V.","3. V.","1. V.","2. V.","3. V."]
[1,{"$f":"IF($M$1=\"\",\"\",IF($D6=$M$1,Eingabe!B3,\"\"))","v":""},{"$f":"IF($M$1=\"\",\"\",IF($D6=$M$1,Eingabe!C3,\"\"))","v":""},{"$f":"IF(Eingabe!$A3=$M$1,$M$1,\"\")","v":""},{"$f":"IF($M$1=\"\",\"\",IF($D6=$M$1,Eingabe!G3,\"\"))","v":""}]
[2,{"$f":"IF($M$1=\"\",\"\",IF($D7=$M$1,Eingabe!B4,\"\"))","v":""},{"$f":"IF($M$1=\"\",\"\",IF($D7=$M$1,Eingabe!C4,\"\"))","v":""},{"$f":"IF(Eingabe!$A4=$M$1,$M$1,\"\")","v":""},{"$f":"IF($M$1=\"\",\"\",IF($D7=$M$1,Eingabe!G4,\"\"))","v":""}]
[3,{"$f":"IF($M$1=\"\",\"\",IF($D8=$M$1,Eingabe!B5,\"\"))","v":""},{"$f":"IF($M$1=\"\",\"\",IF($D8=$M$1,Eingabe!C5,\"\"))","v":""},{"$f":"IF(Eingabe!$A5=$M$1,$M$1,\"\")","v":""},{"$f":"IF($M$1=\"\",\"\",IF($D8=$M$1,Eingabe!G5,\"\"))","v":""}]
[4,{"$f":"IF($M$1=\"\",\"\",IF($D9=$M$1,Eingabe!B6,\"\"))","v":""},{"$f":"IF($M$1=\"\",\"\",IF($D9=$M$1,Eingabe!C6,\"\"))","v":""},{"$f":"IF(Eingabe!$A6=$M$1,$M$1,\"\")","v":""},{"$f":"IF($M$1=\"\",\"\",IF($D9=$M$1,Eingabe!G6,\"\"))","v":""}]
[5,{"$f":"IF($M$1=\"\",\"\",IF($D10=$M$1,Eingabe!B7,\"\"))","v":""},{"$f":"IF($M$1=\"\",\"\",IF($D10=$M$1,Eingabe!C7,\"\"))","v":""},{"$f":"IF(Eingabe!$A7=$M$1,$M$1,\"\")","v":""},{"$f":"IF($M$1=\"\",\"\",IF($D10=$M$1,Eingabe!G7,\"\"))","v":""}]
[6,{"$f":"IF($M$1=\"\",\"\",IF($D11=$M$1,Eingabe!B8,\"\"))","v":""},{"$f":"IF($M$1=\"\",\"\",IF($D11=$M$1,Eingabe!C8,\"\"))","v":""},{"$f":"IF(Eingabe!$A8=$M$1,$M$1,\"\")","v":""},{"$f":"IF($M$1=\"\",\"\",IF($D11=$M$1,Eingabe!G8,\"\"))","v":""}]
[7,{"$f":"IF($M$1=\"\",\"\",IF($D12=$M$1,Eingabe!B9,\"\"))","v":""},{"$f":"IF($M$1=\"\",\"\",IF($D12=$M$1,Eingabe!C9,\"\"))","v":""},{"$f":"IF(Eingabe!$A9=$M$1,$M$1,\"\")","v":""},{"$f":"IF($M$1=\"\",\"\",IF($D12=$M$1,Eingabe!G9,\"\"))","v":""}]
[8,{"$f":"IF($M$1=\"\",\"\",IF($D13=$M$1,Eingabe!B10,\"\"))","v":""},{"$f":"IF($M$1=\"\",\"\",IF($D13=$M$1,Eingabe!C10,\"\"))","v":""},{"$f":"IF(Eingabe!$A10=$M$1,$M$1,\"\")","v":""},{"$f":"IF($M$1=\"\",\"\",IF($D13=$M$1,Eingabe!G10,\"\"))","v":""}]
[9,{"$f":"IF($M$1=\"\",\"\",IF($D14=$M$1,Eingabe!B11,\"\"))","v":""},{"$f":"IF($M$1=\"\",\"\",IF($D14=$M$1,Eingabe!C11,\"\"))","v":""},{"$f":"IF(Eingabe!$A11=$M$1,$M$1,\"\")","v":""},{"$f":"IF($M$1=\"\",\"\",IF($D14=$M$1,Eingabe!G11,\"\"))","v":""}]
[10,{"$f":"IF($M$1=\"\",\"\",IF($D15=$M$1,Eingabe!B12,\"\"))","v":""},{"$f":"IF($M$1=\"\",\"\",IF($D15=$M$1,Eingabe!C12,\"\"))","v":""},{"$f":"IF(Eingabe!$A12=$M$1,$M$1,\"\")","v":""},{"$f":"IF($M$1=\"\",\"\",IF($D15=$M$1,Eingabe!G12,\"\"))","v":""}]
[11,{"$f":"IF($M$1=\"\",\"\",IF($D16=$M$1,Eingabe!B13,\"\"))","v":""},{"$f":"IF($M$1=\"\",\"\",IF($D16=$M$1,Eingabe!C13,\"\"))","v":""},{"$f":"IF(Eingabe!$A13=$M$1,$M$1,\"\")","v":""},{"$f":"IF($M$1=\"\",\"\",IF($D16=$M$1,Eingabe!G13,\"\"))","v":""}]
[12,{"$f":"IF($M$1=\"\",\"\",IF($D17=$M$1,Eingabe!B14,\"\"))","v":""},{"$f":"IF($M$1=\"\",\"\",IF($D17=$M$1,Eingabe!C14,\"\"))","v":""},{"$f":"IF(Eingabe!$A14=$M$1,$M$1,\"\")","v":""},{"$f":"IF($M$1=\"\",\"\",IF($D17=$M$1,Eingabe!G14,\"\"))","v":""}]
[13,{"$f":"IF($M$1=\"\",\"\",IF($D18=$M$1,Eingabe!B15,\"\"))","v":""},{"$f":"IF($M$1=\"\",\"\",IF($D18=$M$1,Eingabe!C15,\"\"))","v":""},{"$f":"IF(Eingabe!$A15=$M$1,$M$1,\"\")","v":""},{"$f":"IF($M$1=\"\",\"\",IF($D18=$M$1,Eingabe!G15,\"\"))","v":""}]
[14,{"$f":"IF($M$1=\"\",\"\",IF($D19=$M$1,Eingabe!B16,\"\"))","v":""},{"$f":"IF($M$1=\"\",\"\",IF($D19=$M$1,Eingabe!C16,\"\"))","v":""},{"$f":"IF(Eingabe!$A16=$M$1,$M$1,\"\")","v":""},{"$f":"IF($M$1=\"\",\"\",IF($D19=$M$1,Eingabe!G16,\"\"))","v":""}]
[15,{"$f":"IF($M$1=\"\",\"\",IF($D20=$M$1,Eingabe!B17,\"\"))","v":""},{"$f":"IF($M$1=\"\",\"\",IF($D20=$M$1,Eingabe!C17,\"\"))","v":""},{"$f":"IF(Eingabe!$A17=$M$1,$M$1,\"\")","v":""},{"$f":"IF($M$1=\"\",\"\",IF($D20=$M$1,Eingabe!G17,\"\"))","v":""}]
[16,{"$f":"IF($M$1=\"\",\"\",IF($D21=$M$1,Eingabe!B18,\"\"))","v":""},{"$f":"IF($M$1=\"\",\"\",IF($D21=$M$1,Eingabe!C18,\"\"))","v":""},{"$f":"IF(Eingabe!$A18=$M$1,$M$1,\"\")","v":""},{"$f":"IF($M$1=\"\",\"\",IF($D21=$M$1,Eingabe!G18,\"\"))","v":""}]
[17,{"$f":"IF($M$1=\"\",\"\",IF($D22=$M$1,Eingabe!B19,\"\"))","v":""},{"$f":"IF($M$1=\"\",\"\",IF($D22=$M$1,Eingabe!C19,\"\"))","v":""},{"$f":"IF(Eingabe!$A19=$M$1,$M$1,\"\")","v":""},{"$f":"IF($M$1=\"\",\"\",IF($D22=$M$1,Eingabe!G19,\"\"))","v":""}]
[18,{"$f":"IF($M$1=\"\",\"\",IF($D23=$M$1,Eingabe!B20,\"\"))","v":""},{"$f":"IF($M$1=\"\",\"\",IF($D23=$M$1,Eingabe!C20,\"\"))","v":""},{"$f":"IF(Eingabe!$A20=$M$1,$M$1,\"\")","v":""},{"$f":"IF($M$1=\"\",\"\",IF($D23=$M$1,Eingabe!G20,\"\"))","v":""}]
[19,{"$f":"IF($M$1=\"\",\"\",IF($D24=$M$1,Eingabe!B21,\"\"))","v":""},{"$f":"IF($M$1=\"\",\"\",IF($D24=$M$1,Eingabe!C21,\"\"))","v":""},{"$f":"IF(Eingabe!$A21=$M$1,$M$1,\"\")","v":""},{"$f":"IF($M$1=\"\",\"\",IF($D24=$M$1,Eingabe!G21,\"\"))","v":""}]
[20,{"$f":"IF($M$1=\"\",\"\",IF($D25=$M$1,Eingabe!B22,\"\"))","v":""},{"$f":"IF($M$1=\"\",\"\",IF($D25=$M$1,Eingabe!C22,\"\"))","v":""},{"$f":"IF(Eingabe!$A22=$M$1,$M$1,\"\")","v":""},{"$f":"IF($M$1=\"\",\"\",IF($D25=$M$1,Eingabe!G22,\"\"))","v":""}]
[21,{"$f":"IF($M$1=\"\",\"\",IF($D26=$M$1,Eingabe!B23,\"\"))","v":""},{"$f":"IF($M$1=\"\",\"\",IF($D26=$M$1,Eingabe!C23,\"\"))","v":""},{"$f":"IF(Eingabe!$A23=$M$1,$M$1,\"\")","v":""},{"$f":"IF($M$1=\"\",\"\",IF($D26=$M$1,Eingabe!G23,\"\"))","v":""}]
[22,{"$f":"IF($M$1=\"\",\"\",IF($D27=$M$1,Eingabe!B24,\"\"))","v":""},{"$f":"IF($M$1=\"\",\"\",IF($D27=$M$1,Eingabe!C24,\"\"))","v":""},{"$f":"IF(Eingabe!$A24=$M$1,$M$1,\"\")","v":""},{"$f":"IF($M$1=\"\",\"\",IF($D27=$M$1,Eingabe!G24,\"\"))","v":""}]
[23,{"$f":"IF($M$1=\"\",\"\",IF($D28=$M$1,Eingabe!B25,\"\"))","v":""},{"$f":"IF($M$1=\"\",\"\",IF($D28=$M$1,Eingabe!C25,\"\"))","v":""},{"$f":"IF(Eingabe!$A25=$M$1,$M$1,\"\")","v":""},{"$f":"IF($M$1=\"\",\"\",IF($D28=$M$1,Eingabe!G25,\"\"))","v":""}]
[24,{"$f":"IF($M$1=\"\",\"\",IF($D29=$M$1,Eingabe!B26,\"\"))","v":""},{"$f":"IF($M$1=\"\",\"\",IF($D29=$M$1,Eingabe!C26,\"\"))","v":""},{"$f":"IF(Eingabe!$A26=$M$1,$M$1,\"\")","v":""},{"$f":"IF($M$1=\"\",\"\",IF($D29=$M$1,Eingabe!G26,\"\"))","v":""}]
[25,{"$f":"IF($M$1=\"\",\"\",IF($D30=$M$1,Eingabe!B27,\"\"))","v":""},{"$f":"IF($M$1=\"\",\"\",IF($D30=$M$1,Eingabe!C27,\"\"))","v":""},{"$f":"IF(Eingabe!$A27=$M$1,$M$1,\"\")","v":""},{"$f":"IF($M$1=\"\",\"\",IF($D30=$M$1,Eingabe!G27,\"\"))","v":""}]
[26,{"$f":"IF($M$1=\"\",\"\",IF($D31=$M$1,Eingabe!B28,\"\"))","v":""},{"$f":"IF($M$1=\"\",\"\",IF($D31=$M$1,Eingabe!C28,\"\"))","v":""},{"$f":"IF(Eingabe!$A28=$M$1,$M$1,\"\")","v":""},{"$f":"IF($M$1=\"\",\"\",IF($D31=$M$1,Eingabe!G28,\"\"))","v":""}]
[27,{"$f":"IF($M$1=\"\",\"\",IF($D32=$M$1,Eingabe!B29,\"\"))","v":""},{"$f":"IF($M$1=\"\",\"\",IF($D32=$M$1,Eingabe!C29,\"\"))","v":""},{"$f":"IF(Eingabe!$A29=$M$1,$M$1,\"\")","v":""},{"$f":"IF($M$1=\"\",\"\",IF($D32=$M$1,Eingabe!G29,\"\"))","v":""}]
[28,{"$f":"IF($M$1=\"\",\"\",IF($D33=$M$1,Eingabe!B30,\"\"))","v":""},{"$f":"IF($M$1=\"\",\"\",IF($D33=$M$1,Eingabe!C30,\"\"))","v":""},{"$f":"IF(Eingabe!$A30=$M$1,$M$1,\"\")","v":""},{"$f":"IF($M$1=\"\",\"\",IF($D33=$M$1,Eingabe!G30,\"\"))","v":""}]
[29,{"$f":"IF($M$1=\"\",\"\",IF($D34=$M$1,Eingabe!B31,\"\"))","v":""},{"$f":"IF($M$1=\"\",\"\",IF($D34=$M$1,Eingabe!C31,\"\"))","v":""},{"$f":"IF(Eingabe!$A31=$M$1,$M$1,\"\")","v":""},{"$f":"IF($M$1=\"\",\"\",IF($D34=$M$1,Eingabe!G31,\"\"))","v":""}]
[30,{"$f":"IF($M$1=\"\",\"\",IF($D35=$M$1,Eingabe!B32,\"\"))","v":""},{"$f":"IF($M$1=\"\",\"\",IF($D35=$M$1,Eingabe!C32,\"\"))","v":""},{"$f":"IF(Eingabe!$A32=$M$1,$M$1,\"\")","v":""},{"$f":"IF($M$1=\"\",\"\",IF($D35=$M$1,Eingabe!G32,\"\"))","v":""}]
[31,{"$f":"IF($M$1=\"\",\"\",IF($D36=$M$1,Eingabe!B33,\"\"))","v":""},{"$f":"IF($M$1=\"\",\"\",IF($D36=$M$1,Eingabe!C33,\"\"))","v":""},{"$f":"IF(Eingabe!$A33=$M$1,$M$1,\"\")","v":""},{"$f":"IF($M$1=\"\",\"\",IF($D36=$M$1,Eingabe!G33,\"\"))","v":""}]
[32,{"$f":"IF($M$1=\"\",\"\",IF($D37=$M$1,Eingabe!B34,\"\"))","v":""},{"$f":"IF($M$1=\"\",\"\",IF($D37=$M$1,Eingabe!C34,\"\"))","v":""},{"$f":"IF(Eingabe!$A34=$M$1,$M$1,\"\")","v":""},{"$f":"IF($M$1=\"\",\"\",IF($D37=$M$1,Eingabe!G34,\"\"))","v":""}]
[33,{"$f":"IF($M$1=\"\",\"\",IF($D38=$M$1,Eingabe!B35,\"\"))","v":""},{"$f":"IF($M$1=\"\",\"\",IF($D38=$M$1,Eingabe!C35,\"\"))","v":""},{"$f":"IF(Eingabe!$A35=$M$1,$M$1,\"\")","v":""},{"$f":"IF($M$1=\"\",\"\",IF($D38=$M$1,Eingabe!G35,\"\"))","v":""}]
[34,{"$f":"IF($M$1=\"\",\"\",IF($D39=$M$1,Eingabe!B36,\"\"))","v":""},{"$f":"IF($M$1=\"\",\"\",IF($D39=$M$1,Eingabe!C36,\"\"))","v":""},{"$f":"IF(Eingabe!$A36=$M$1,$M$1,\"\")","v":""},{"$f":"IF($M$1=\"\",\"\",IF($D39=$M$1,Eingabe!G36,\"\"))","v":""}]
[35,{"$f":"IF($M$1=\"\",\"\",IF($D40=$M$1,Eingabe!B37,\"\"))","v":""},{"$f":"IF($M$1=\"\",\"\",IF($D40=$M$1,Eingabe!C37,\"\"))","v":""},{"$f":"IF(Eingabe!$A37=$M$1,$M$1,\"\")","v":""},{"$f":"IF($M$1=\"\",\"\",IF($D40=$M$1,Eingabe!G37,\"\"))","v":""}]
[36,{"$f":"IF($M$1=\"\",\"\",IF($D41=$M$1,Eingabe!B38,\"\"))","v":""},{"$f":"IF($M$1=\"\",\"\",IF($D41=$M$1,Eingabe!C38,\"\"))","v":""},{"$f":"IF(Eingabe!$A38=$M$1,$M$1,\"\")","v":""},{"$f":"IF($M$1=\"\",\"\",IF($D41=$M$1,Eingabe!G38,\"\"))","v":""}]
[37,{"$f":"IF($M$1=\"\",\"\",IF($D42=$M$1,Eingabe!B39,\"\"))","v":""},{"$f":"IF($M$1=\"\",\"\",IF($D42=$M$1,Eingabe!C39,\"\"))","v":""},{"$f":"IF(Eingabe!$A39=$M$1,$M$1,\"\")","v":""},{"$f":"IF($M$1=\"\",\"\",IF($D42=$M$1,Eingabe!G39,\"\"))","v":""}]
[38,{"$f":"IF($M$1=\"\",\"\",IF($D43=$M$1,Eingabe!B40,\"\"))","v":""},{"$f":"IF($M$1=\"\",\"\",IF($D43=$M$1,Eingabe!C40,\"\"))","v":""},{"$f":"IF(Eingabe!$A40=$M$1,$M$1,\"\")","v":""},{"$f":"IF($M$1=\"\",\"\",IF($D43=$M$1,Eingabe!G40,\"\"))","v":""}]
[39,{"$f":"IF($M$1=\"\",\"\",IF($D44=$M$1,Eingabe!B41,\"\"))","v":""},{"$f":"IF($M$1=\"\",\"\",IF($D44=$M$1,Eingabe!C41,\"\"))","v":""},{"$f":"IF(Eingabe!$A41=$M$1,$M$1,\"\")","v":""},{"$f":"IF($M$1=\"\",\"\",IF($D44=$M$1,Eingabe!G41,\"\"))","v":""}]
[40,{"$f":"IF($M$1=\"\",\"\",IF($D45=$M$1,Eingabe!B42,\"\"))","v":""},{"$f":"IF($M$1=\"\",\"\",IF($D45=$M$1,Eingabe!C42,\"\"))","v":""},{"$f":"IF(Eingabe!$A42=$M$1,$M$1,\"\")","v":""},{"$f":"IF($M$1=\"\",\"\",IF($D45=$M$1,Eingabe!G42,\"\"))","v":""}]
[41,{"$f":"IF($M$1=\"\",\"\",IF($D46=$M$1,Eingabe!B43,\"\"))","v":""},{"$f":"IF($M$1=\"\",\"\",IF($D46=$M$1,Eingabe!C43,\"\"))","v":""},{"$f":"IF(Eingabe!$A43=$M$1,$M$1,\"\")","v":""},{"$f":"IF($M$1=\"\",\"\",IF($D46=$M$1,Eingabe!G43,\"\"))","v":""}]
[42,{"$f":"IF($M$1=\"\",\"\",IF($D47=$M$1,Eingabe!B44,\"\"))","v":""},{"$f":"IF($M$1=\"\",\"\",IF($D47=$M$1,Eingabe!C44,\"\"))","v":""},{"$f":"IF(Eingabe!$A44=$M$1,$M$1,\"\")","v":""},{"$f":"IF($M$1=\"\",\"\",IF($D47=$M$1,Eingabe!G44,\"\"))","v":""}]
[43,{"$f":"IF($M$1=\"\",\"\",IF($D48=$M$1,Eingabe!B45,\"\"))","v":""},{"$f":"IF($M$1=\"\",\"\",IF($D48=$M$1,Eingabe!C45,\"\"))","v":""},{"$f":"IF(Eingabe!$A45=$M$1,$M$1,\"\")","v":""},{"$f":"IF($M$1=\"\",\"\",IF($D48=$M$1,Eingabe!G45,\"\"))","v":""}]
[44,{"$f":"IF($M$1=\"\",\"\",IF($D49=$M$1,Eingabe!B46,\"\"))","v":""},{"$f":"IF($M$1=\"\",\"\",IF($D49=$M$1,Eingabe!C46,\"\"))","v":""},{"$f":"IF(Eingabe!$A46=$M$1,$M$1,\"\")","v":""},{"$f":"IF($M$1=\"\",\"\",IF($D49=$M$1,Eingabe!G46,\"\"))","v":""}]
[45,{"$f":"IF($M$1=\"\",\"\",IF($D50=$M$1,Eingabe!B47,\"\"))","v":""},{"$f":"IF($M$1=\"\",\"\",IF($D50=$M$1,Eingabe!C47,\"\"))","v":""},{"$f":"IF(Eingabe!$A47=$M$1,$M$1,\"\")","v":""},{"$f":"IF($M$1=\"\",\"\",IF($D50=$M$1,Eingabe!G47,\"\"))","v":""}]
[46,{"$f":"IF($M$1=\"\",\"\",IF($D51=$M$1,Eingabe!B48,\"\"))","v":""},{"$f":"IF($M$1=\"\",\"\",IF($D51=$M$1,Eingabe!C48,\"\"))","v":""},{"$f":"IF(Eingabe!$A48=$M$1,$M$1,\"\")","v":""},{"$f":"IF($M$1=\"\",\"\",IF($D51=$M$1,Eingabe!G48,\"\"))","v":""}]
[47,{"$f":"IF($M$1=\"\",\"\",IF($D52=$M$1,Eingabe!B49,\"\"))","v":""},{"$f":"IF($M$1=\"\",\"\",IF($D52=$M$1,Eingabe!C49,\"\"))","v":""},{"$f":"IF(Eingabe!$A49=$M$1,$M$1,\"\")","v":""},{"$f":"IF($M$1=\"\",\"\",IF($D52=$M$1,Eingabe!G49,\"\"))","v":""}]
[48,{"$f":"IF($M$1=\"\",\"\",IF($D53=$M$1,Eingabe!B50,\"\"))","v":""},{"$f":"IF($M$1=\"\",\"\",IF($D53=$M$1,Eingabe!C50,\"\"))","v":""},{"$f":"IF(Eingabe!$A50=$M$1,$M$1,\"\")","v":""},{"$f":"IF($M$1=\"\",\"\",IF($D53=$M$1,Eingabe!G50,\"\"))","v":""}]
[49,{"$f":"IF($M$1=\"\",\"\",IF($D54=$M$1,Eingabe!B51,\"\"))","v":""},{"$f":"IF($M$1=\"\",\"\",IF($D54=$M$1,Eingabe!C51,\"\"))","v":""},{"$f":"IF(Eingabe!$A51=$M$1,$M$1,\"\")","v":""},{"$f":"IF($M$1=\"\",\"\",IF($D54=$M$1,Eingabe!G51,\"\"))","v":""}]
[50,{"$f":"IF($M$1=\"\",\"\",IF($D55=$M$1,Eingabe!B52,\"\"))","v":""},{"$f":"IF($M$1=\"\",\"\",IF($D55=$M$1,Eingabe!C52,\"\"))","v":""},{"$f":"IF(Eingabe!$A52=$M$1,$M$1,\"\")","v":""},{"$f":"IF($M$1=\"\",\"\",IF($D55=$M$1,Eingabe!G52,\"\"))","v":""}]
[51,{"$f":"IF($M$1=\"\",\"\",IF($D56=$M$1,Eingabe!B53,\"\"))","v":""},{"$f":"IF($M$1=\"\",\"\",IF($D56=$M$1,Eingabe!C53,\"\"))","v":""},{"$f":"IF(Eingabe!$A53=$M$1,$M$1,\"\")","v":""},{"$f":"IF($M$1=\"\",\"\",IF($D56=$M$1,Eingabe!G53,\"\"))","v":""}]
[52,{"$f":"IF($M$1=\"\",\"\",IF($D57=$M$1,Eingabe!B54,\"\"))","v":""},{"$f":"IF($M$1=\"\",\"\",IF($D57=$M$1,Eingabe!C54,\"\"))","v":""},{"$f":"IF(Eingabe!$A54=$M$1,$M$1,\"\")","v":""},{"$f":"IF($M$1=\"\",\"\",IF($D57=$M$1,Eingabe!G54,\"\"))","v":""}]
[53,{"$f":"IF($M$1=\"\",\"\",IF($D58=$M$1,Eingabe!B55,\"\"))","v":""},{"$f":"IF($M$1=\"\",\"\",IF($D58=$M$1,Eingabe!C55,\"\"))","v":""},{"$f":"IF(Eingabe!$A55=$M$1,$M$1,\"\")","v":""},{"$f":"IF($M$1=\"\",\"\",IF($D58=$M$1,Eingabe!G55,\"\"))","v":""}]
[54,{"$f":"IF($M$1=\"\",\"\",IF($D59=$M$1,Eingabe!B56,\"\"))","v":""},{"$f":"IF($M$1=\"\",\"\",IF($D59=$M$1,Eingabe!C56,\"\"))","v":""},{"$f":"IF(Eingabe!$A56=$M$1,$M$1,\"\")","v":""},{"$f":"IF($M$1=\"\",\"\",IF($D59=$M$1,Eingabe!G56,\"\"))","v":""}]
[55,{"$f":"IF($M$1=\"\",\"\",IF($D60=$M$1,Eingabe!B57,\"\"))","v":""},{"$f":"IF($M$1=\"\",\"\",IF($D60=$M$1,Eingabe!C57,\"\"))","v":""},{"$f":"IF(Eingabe!$A57=$M$1,$M$1,\"\")","v":""},{"$f":"IF($M$1=\"\",\"\",IF($D60=$M$1,Eingabe!G57,\"\"))","v":""}]
[56,{"$f":"IF($M$1=\"\",\"\",IF($D61=$M$1,Eingabe!B58,\"\"))","v":""},{"$f":"IF($M$1=\"\",\"\",IF($D61=$M$1,Eingabe!C58,\"\"))","v":""},{"$f":"IF(Eingabe!$A58=$M$1,$M$1,\"\")","v":""},{"$f":"IF($M$1=\"\",\"\",IF($D61=$M$1,Eingabe!G58,\"\"))","v":""}]
[57,{"$f":"IF($M$1=\"\",\"\",IF($D62=$M$1,Eingabe!B59,\"\"))","v":""},{"$f":"IF($M$1=\"\",\"\",IF($D62=$M$1,Eingabe!C59,\"\"))","v":""},{"$f":"IF(Eingabe!$A59=$M$1,$M$1,\"\")","v":""},{"$f":"IF($M$1=\"\",\"\",IF($D62=$M$1,Eingabe!G59,\"\"))","v":""}]
[58,{"$f":"IF($M$1=\"\",\"\",IF($D63=$M$1,Eingabe!B60,\"\"))","v":""},{"$f":"IF($M$1=\"\",\"\",IF($D63=$M$1,Eingabe!C60,\"\"))","v":""},{"$f":"IF(Eingabe!$A60=$M$1,$M$1,\"\")","v":""},{"$f":"IF($M$1=\"\",\"\",IF($D63=$M$1,Eingabe!G60,\"\"))","v":""}]
[59,{"$f":"IF($M$1=\"\",\"\",IF($D64=$M$1,Eingabe!B61,\"\"))","v":""},{"$f":"IF($M$1=\"\",\"\",IF($D64=$M$1,Eingabe!C61,\"\"))","v":""},{"$f":"IF(Eingabe!$A61=$M$1,$M$1,\"\")","v":""},{"$f":"IF($M$1=\"\",\"\",IF($D64=$M$1,Eingabe!G61,\"\"))","v":""}]
[60,{"$f":"IF($M$1=\"\",\"\",IF($D65=$M$1,Eingabe!B62,\"\"))","v":""},{"$f":"IF($M$1=\"\",\"\",IF($D65=$M$1,Eingabe!C62,\"\"))","v":""},{"$f":"IF(Eingabe!$A62=$M$1,$M$1,\"\")","v":""},{"$f":"IF($M$1=\"\",\"\",IF($D65=$M$1,Eingabe!G62,\"\"))","v":""}]
[61,{"$f":"IF($M$1=\"\",\"\",IF($D66=$M$1,Eingabe!B63,\"\"))","v":""},{"$f":"IF($M$1=\"\",\"\",IF($D66=$M$1,Eingabe!C63,\"\"))","v":""},{"$f":"IF(Eingabe!$A63=$M$1,$M$1,\"\")","v":""},{"$f":"IF($M$1=\"\",\"\",IF($D66=$M$1,Eingabe!G63,\"\"))","v":""}]
[62,{"$f":"IF($M$1=\"\",\"\",IF($D67=$M$1,Eingabe!B64,\"\"))","v":""},{"$f":"IF($M$1=\"\",\"\",IF($D67=$M$1,Eingabe!C64,\"\"))","v":""},{"$f":"IF(Eingabe!$A64=$M$1,$M$1,\"\")","v":""},{"$f":"IF($M$1=\"\",\"\",IF($D67=$M$1,Eingabe!G64,\"\"))","v":""}]
[63,{"$f":"IF($M$1=\"\",\"\",IF($D68=$M$1,Eingabe!B65,\"\"))","v":""},{"$f":"IF($M$1=\"\",\"\",IF($D68=$M$1,Eingabe!C65,\"\"))","v":""},{"$f":"IF(Eingabe!$A65=$M$1,$M$1,\"\")","v":""},{"$f":"IF($M$1=\"\",\"\",IF($D68=$M$1,Eingabe!G65,\"\"))","v":""}]
[64,{"$f":"IF($M$1=\"\",\"\",IF($D69=$M$1,Eingabe!B66,\"\"))","v":""},{"$f":"IF($M$1=\"\",\"\",IF($D69=$M$1,Eingabe!C66,\"\"))","v":""},{"$f":"IF(Eingabe!$A66=$M$1,$M$1,\"\")","v":""},{"$f":"IF($M$1=\"\",\"\",IF($D69=$M$1,Eingabe!G66,\"\"))","v":""}]
[65,{"$f":"IF($M$1=\"\",\"\",IF($D70=$M$1,Eingabe!B67,\"\"))","v":""},{"$f":"IF($M$1=\"\",\"\",IF($D70=$M$1,Eingabe!C67,\"\"))","v":""},{"$f":"IF(Eingabe!$A67=$M$1,$M$1,\"\")","v":""},{"$f":"IF($M$1=\"\",\"\",IF($D70=$M$1,Eingabe!G67,\"\"))","v":""}]
[66,{"$f":"IF($M$1=\"\",\"\",IF($D71=$M$1,Eingabe!B68,\"\"))","v":""},{"$f":"IF($M$1=\"\",\"\",IF($D71=$M$1,Eingabe!C68,\"\"))","v":""},{"$f":"IF(Eingabe!$A68=$M$1,$M$1,\"\")","v":""},{"$f":"IF($M$1=\"\",\"\",IF($D71=$M$1,Eingabe!G68,\"\"))","v":""}]
[67,{"$f":"IF($M$1=\"\",\"\",IF($D72=$M$1,Eingabe!B69,\"\"))","v":""},{"$f":"IF($M$1=\"\",\"\",IF($D72=$M$1,Eingabe!C69,\"\"))","v":""},{"$f":"IF(Eingabe!$A69=$M$1,$M$1,\"\")","v":""},{"$f":"IF($M$1=\"\",\"\",IF($D72=$M$1,Eingabe!G69,\"\"))","v":""}]
[68,{"$f":"IF($M$1=\"\",\"\",IF($D73=$M$1,Eingabe!B70,\"\"))","v":""},{"$f":"IF($M$1=\"\",\"\",IF($D73=$M$1,Eingabe!C70,\"\"))","v":""},{"$f":"IF(Eingabe!$A70=$M$1,$M$1,\"\")","v":""},{"$f":"IF($M$1=\"\",\"\",IF($D73=$M$1,Eingabe!G70,\"\"))","v":""}]
[69,{"$f":"IF($M$1=\"\",\"\",IF($D74=$M$1,Eingabe!B71,\"\"))","v":""},{"$f":"IF($M$1=\"\",\"\",IF($D74=$M$1,Eingabe!C71,\"\"))","v":""},{"$f":"IF(Eingabe!$A71=$M$1,$M$1,\"\")","v":""},{"$f":"IF($M$1=\"\",\"\",IF($D74=$M$1,Eingabe!G71,\"\"))","v":""}]
[70,{"$f":"IF($M$1=\"\",\"\",IF($D75=$M$1,Eingabe!B72,\"\"))","v":""},{"$f":"IF($M$1=\"\",\"\",IF($D75=$M$1,Eingabe!C72,\"\"))","v":""},{"$f":"IF(Eingabe!$A72=$M$1,$M$1,\"\")","v":""},{"$f":"IF($M$1=\"\",\"\",IF($D75=$M$1,Eingabe!G72,\"\"))","v":""}]
[71,{"$f":"IF($M$1=\"\",\"\",IF($D76=$M$1,Eingabe!B73,\"\"))","v":""},{"$f":"IF($M$1=\"\",\"\",IF($D76=$M$1,Eingabe!C73,\"\"))","v":""},{"$f":"IF(Eingabe!$A73=$M$1,$M$1,\"\")","v":""},{"$f":"IF($M$1=\"\",\"\",IF($D76=$M$1,Eingabe!G73,\"\"))","v":""}]
[72,{"$f":"IF($M$1=\"\",\"\",IF($D77=$M$1,Eingabe!B74,\"\"))","v":""},{"$f":"IF($M$1=\"\",\"\",IF($D77=$M$1,Eingabe!C74,\"\"))","v":""},{"$f":"IF(Eingabe!$A74=$M$1,$M$1,\"\")","v":""},{"$f":"IF($M$1=\"\",\"\",IF($D77=$M$1,Eingabe!G74,\"\"))","v":""}]
[73,{"$f":"IF($M$1=\"\",\"\",IF($D78=$M$1,Eingabe!B75,\"\"))","v":""},{"$f":"IF($M$1=\"\",\"\",IF($D78=$M$1,Eingabe!C75,\"\"))","v":""},{"$f":"IF(Eingabe!$A75=$M$1,$M$1,\"\")","v":""},{"$f":"IF($M$1=\"\",\"\",IF($D78=$M$1,Eingabe!G75,\"\"))","v":""}]
[74,{"$f":"IF($M$1=\"\",\"\",IF($D79=$M$1,Eingabe!B76,\"\"))","v":""},{"$f":"IF($M$1=\"\",\"\",IF($D79=$M$1,Eingabe!C76,\"\"))","v":""},{"$f":"IF(Eingabe!$A76=$M$1,$M$1,\"\")","v":""},{"$f":"IF($M$1=\"\",\"\",IF($D79=$M$1,Eingabe!G76,\"\"))","v":""}]
[75,{"$f":"IF($M$1=\"\",\"\",IF($D80=$M$1,Eingabe!B77,\"\"))","v":""},{"$f":"IF($M$1=\"\",\"\",IF($D80=$M$1,Eingabe!C77,\"\"))","v":""},{"$f":"IF(Eingabe!$A77=$M$1,$M$1,\"\")","v":""},{"$f":"IF($M$1=\"\",\"\",IF($D80=$M$1,Eingabe!G77,\"\"))","v":""}]
[76,{"$f":"IF($M$1=\"\",\"\",IF($D81=$M$1,Eingabe!B78,\"\"))","v":""},{"$f":"IF($M$1=\"\",\"\",IF($D81=$M$1,Eingabe!C78,\"\"))","v":""},{"$f":"IF(Eingabe!$A78=$M$1,$M$1,\"\")","v":""},{"$f":"IF($M$1=\"\",\"\",IF($D81=$M$1,Eingabe!G78,\"\"))","v":""}]
[77,{"$f":"IF($M$1=\"\",\"\",IF($D82=$M$1,Eingabe!B79,\"\"))","v":""},{"$f":"IF($M$1=\"\",\"\",IF($D82=$M$1,Eingabe!C79,\"\"))","v":""},{"$f":"IF(Eingabe!$A79=$M$1,$M$1,\"\")","v":""},{"$f":"IF($M$1=\"\",\"\",IF($D82=$M$1,Eingabe!G79,\"\"))","v":""}]
[78,{"$f":"IF($M$1=\"\",\"\",IF($D83=$M$1,Eingabe!B80,\"\"))","v":""},{"$f":"IF($M$1=\"\",\"\",IF($D83=$M$1,Eingabe!C80,\"\"))","v":""},{"$f":"IF(Eingabe!$A80=$M$1,$M$1,\"\")","v":""},{"$f":"IF($M$1=\"\",\"\",IF($D83=$M$1,Eingabe!G80,\"\"))","v":""}]
[79,{"$f":"IF($M$1=\"\",\"\",IF($D84=$M$1,Eingabe!B81,\"\"))","v":""},{"$f":"IF($M$1=\"\",\"\",IF($D84=$M$1,Eingabe!C81,\"\"))","v":""},{"$f":"IF(Eingabe!$A81=$M$1,$M$1,\"\")","v":""},{"$f":"IF($M$1=\"\",\"\",IF($D84=$M$1,Eingabe!G81,\"\"))","v":""}]
[80,{"$f":"IF($M$1=\"\",\"\",IF($D85=$M$1,Eingabe!B82,\"\"))","v":""},{"$f":"IF($M$1=\"\",\"\",IF($D85=$M$1,Eingabe!C82,\"\"))","v":""},{"$f":"IF(Eingabe!$A82=$M$1,$M$1,\"\")","v":""},{"$f":"IF($M$1=\"\",\"\",IF($D85=$M$1,Eingabe!G82,\"\"))","v":""}]
[81,{"$f":"IF($M$1=\"\",\"\",IF($D86=$M$1,Eingabe!B83,\"\"))","v":""},{"$f":"IF($M$1=\"\",\"\",IF($D86=$M$1,Eingabe!C83,\"\"))","v":""},{"$f":"IF(Eingabe!$A83=$M$1,$M$1,\"\")","v":""},{"$f":"IF($M$1=\"\",\"\",IF($D86=$M$1,Eingabe!G83,\"\"))","v":""}]
[82,{"$f":"IF($M$1=\"\",\"\",IF($D87=$M$1,Eingabe!B84,\"\"))","v":""},{"$f":"IF($M$1=\"\",\"\",IF($D87=$M$1,Eingabe!C84,\"\"))","v":""},{"$f":"IF(Eingabe!$A84=$M$1,$M$1,\"\")","v":""},{"$f":"IF($M$1=\"\",\"\",IF($D87=$M$1,Eingabe!G84,\"\"))","v":""}]
[83,{"$f":"IF($M$1=\"\",\"\",IF($D88=$M$1,Eingabe!B85,\"\"))","v":""},{"$f":"IF($M$1=\"\",\"\",IF($D88=$M$1,Eingabe!C85,\"\"))","v":""},{"$f":"IF(Eingabe!$A85=$M$1,$M$1,\"\")","v":""},{"$f":"IF($M$1=\"\",\"\",IF($D88=$M$1,Eingabe!G85,\"\"))","v":""}]
[84,{"$f":"IF($M$1=\"\",\"\",IF($D89=$M$1,Eingabe!B86,\"\"))","v":""},{"$f":"IF($M$1=\"\",\"\",IF($D89=$M$1,Eingabe!C86,\"\"))","v":""},{"$f":"IF(Eingabe!$A86=$M$1,$M$1,\"\")","v":""},{"$f":"IF($M$1=\"\",\"\",IF($D89=$M$1,Eingabe!G86,\"\"))","v":""}]
[85,{"$f":"IF($M$1=\"\",\"\",IF($D90=$M$1,Eingabe!B87,\"\"))","v":""},{"$f":"IF($M$1=\"\",\"\",IF($D90=$M$1,Eingabe!C87,\"\"))","v":""},{"$f":"IF(Eingabe!$A87=$M$1,$M$1,\"\")","v":""},{"$f":"IF($M$1=\"\",\"\",IF($D90=$M$1,Eingabe!G87,\"\"))","v":""}]
[86,{"$f":"IF($M$1=\"\",\"\",IF($D91=$M$1,Eingabe!B88,\"\"))","v":""},{"$f":"IF($M$1=\"\",\"\",IF($D91=$M$1,Eingabe!C88,\"\"))","v":""},{"$f":"IF(Eingabe!$A88=$M$1,$M$1,\"\")","v":""},{"$f":"IF($M$1=\"\",\"\",IF($D91=$M$1,Eingabe!G88,\"\"))","v":""}]
[87,{"$f":"IF($M$1=\"\",\"\",IF($D92=$M$1,Eingabe!B89,\"\"))","v":""},{"$f":"IF($M$1=\"\",\"\",IF($D92=$M$1,Eingabe!C89,\"\"))","v":""},{"$f":"IF(Eingabe!$A89=$M$1,$M$1,\"\")","v":""},{"$f":"IF($M$1=\"\",\"\",IF($D92=$M$1,Eingabe!G89,\"\"))","v":""}]
[88,{"$f":"IF($M$1=\"\",\"\",IF($D93=$M$1,Eingabe!B90,\"\"))","v":""},{"$f":"IF($M$1=\"\",\"\",IF($D93=$M$1,Eingabe!C90,\"\"))","v":""},{"$f":"IF(Eingabe!$A90=$M$1,$M$1,\"\")","v":""},{"$f":"IF($M$1=\"\",\"\",IF($D93=$M$1,Eingabe!G90,\"\"))","v":""}]
[89,{"$f":"IF($M$1=\"\",\"\",IF($D94=$M$1,Eingabe!B91,\"\"))","v":""},{"$f":"IF($M$1=\"\",\"\",IF($D94=$M$1,Eingabe!C91,\"\"))","v":""},{"$f":"IF(Eingabe!$A91=$M$1,$M$1,\"\")","v":""},{"$f":"IF($M$1=\"\",\"\",IF($D94=$M$1,Eingabe!G91,\"\"))","v":""}]
[90,{"$f":"IF($M$1=\"\",\"\",IF($D95=$M$1,Eingabe!B92,\"\"))","v":""},{"$f":"IF($M$1=\"\",\"\",IF($D95=$M$1,Eingabe!C92,\"\"))","v":""},{"$f":"IF(Eingabe!$A92=$M$1,$M$1,\"\")","v":""},{"$f":"IF($M$1=\"\",\"\",IF($D95=$M$1,Eingabe!G92,\"\"))","v":""}]
[91,{"$f":"IF($M$1=\"\",\"\",IF($D96=$M$1,Eingabe!B93,\"\"))","v":""},{"$f":"IF($M$1=\"\",\"\",IF($D96=$M$1,Eingabe!C93,\"\"))","v":""},{"$f":"IF(Eingabe!$A93=$M$1,$M$1,\"\")","v":""},{"$f":"IF($M$1=\"\",\"\",IF($D96=$M$1,Eingabe!G93,\"\"))","v":""}]
[92,{"$f":"IF($M$1=\"\",\"\",IF($D97=$M$1,Eingabe!B94,\"\"))","v":""},{"$f":"IF($M$1=\"\",\"\",IF($D97=$M$1,Eingabe!C94,\"\"))","v":""},{"$f":"IF(Eingabe!$A94=$M$1,$M$1,\"\")","v":""},{"$f":"IF($M$1=\"\",\"\",IF($D97=$M$1,Eingabe!G94,\"\"))","v":""}]
[93,{"$f":"IF($M$1=\"\",\"\",IF($D98=$M$1,Eingabe!B95,\"\"))","v":""},{"$f":"IF($M$1=\"\",\"\",IF($D98=$M$1,Eingabe!C95,\"\"))","v":""},{"$f":"IF(Eingabe!$A95=$M$1,$M$1,\"\")","v":""},{"$f":"IF($M$1=\"\",\"\",IF($D98=$M$1,Eingabe!G95,\"\"))","v":""}]
[94,{"$f":"IF($M$1=\"\",\"\",IF($D99=$M$1,Eingabe!B96,\"\"))","v":""},{"$f":"IF($M$1=\"\",\"\",IF($D99=$M$1,Eingabe!C96,\"\"))","v":""},{"$f":"IF(Eingabe!$A96=$M$1,$M$1,\"\")","v":""},{"$f":"IF($M$1=\"\",\"\",IF($D99=$M$1,Eingabe!G96,\"\"))","v":""}]
[95,{"$f":"IF($M$1=\"\",\"\",IF($D100=$M$1,Eingabe!B97,\"\"))","v":""},{"$f":"IF($M$1=\"\",\"\",IF($D100=$M$1,Eingabe!C97,\"\"))","v":""},{"$f":"IF(Eingabe!$A97=$M$1,$M$1,\"\")","v":""},{"$f":"IF($M$1=\"\",\"\",IF($D100=$M$1,Eingabe!G97,\"\"))","v":""}]
[96,{"$f":"IF($M$1=\"\",\"\",IF($D101=$M$1,Eingabe!B98,\"\"))","v":""},{"$f":"IF($M$1=\"\",\"\",IF($D101=$M$1,Eingabe!C98,\"\"))","v":""},{"$f":"IF(Eingabe!$A98=$M$1,$M$1,\"\")","v":""},{"$f":"IF($M$1=\"\",\"\",IF($D101=$M$1,Eingabe!G98,\"\"))","v":""}]
[97,{"$f":"IF($M$1=\"\",\"\",IF($D102=$M$1,Eingabe!B99,\"\"))","v":""},{"$f":"IF($M$1=\"\",\"\",IF($D102=$M$1,Eingabe!C99,\"\"))","v":""},{"$f":"IF(Eingabe!$A99=$M$1,$M$1,\"\")","v":""},{"$f":"IF($M$1=\"\",\"\",IF($D102=$M$1,Eingabe!G99,\"\"))","v":""}]
[98,{"$f":"IF($M$1=\"\",\"\",IF($D103=$M$1,Eingabe!B100,\"\"))","v":""},{"$f":"IF($M$1=\"\",\"\",IF($D103=$M$1,Eingabe!C100,\"\"))","v":""},{"$f":"IF(Eingabe!$A100=$M$1,$M$1,\"\")","v":""},{"$f":"IF($M$1=\"\",\"\",IF($D103=$M$1,Eingabe!G100,\"\"))","v":""}]
[99,{"$f":"IF($M$1=\"\",\"\",IF($D104=$M$1,Eingabe!B101,\"\"))","v":""},{"$f":"IF($M$1=\"\",\"\",IF($D104=$M$1,Eingabe!C101,\"\"))","v":""},{"$f":"IF(Eingabe!$A101=$M$1,$M$1,\"\")","v":""},{"$f":"IF($M$1=\"\",\"\",IF($D104=$M$1,Eingabe!G101,\"\"))","v":""}]
[100,{"$f":"IF($M$1=\"\",\"\",IF($D105=$M$1,Eingabe!B102,\"\"))","v":""},{"$f":"IF($M$1=\"\",\"\",IF($D105=$M$1,Eingabe!C102,\"\"))","v":""},{"$f":"IF(Eingabe!$A102=$M$1,$M$1,\"\")","v":""},{"$f":"IF($M$1=\"\",\"\",IF($D105=$M$1,Eingabe!G102,\"\"))","v":""}]
[101,{"$f":"IF($M$1=\"\",\"\",IF($D106=$M$1,Eingabe!B103,\"\"))","v":""},{"$f":"IF($M$1=\"\",\"\",IF($D106=$M$1,Eingabe!C103,\"\"))","v":""},{"$f":"IF(Eingabe!$A103=$M$1,$M$1,\"\")","v":""},{"$f":"IF($M$1=\"\",\"\",IF($D106=$M$1,Eingabe!G103,\"\"))","v":""}]
[102,{"$f":"IF($M$1=\"\",\"\",IF($D107=$M$1,Eingabe!B104,\"\"))","v":""},{"$f":"IF($M$1=\"\",\"\",IF($D107=$M$1,Eingabe!C104,\"\"))","v":""},{"$f":"IF(Eingabe!$A104=$M$1,$M$1,\"\")","v":""},{"$f":"IF($M$1=\"\",\"\",IF($D107=$M$1,Eingabe!G104,\"\"))","v":""}]
[103,{"$f":"IF($M$1=\"\",\"\",IF($D108=$M$1,Eingabe!B105,\"\"))","v":""},{"$f":"IF($M$1=\"\",\"\",IF($D108=$M$1,Eingabe!C105,\"\"))","v":""},{"$f":"IF(Eingabe!$A105=$M$1,$M$1,\"\")","v":""},{"$f":"IF($M$1=\"\",\"\",IF($D108=$M$1,Eingabe!G105,\"\"))","v":""}]
[104,{"$f":"IF($M$1=\"\",\"\",IF($D109=$M$1,Eingabe!B106,\"\"))","v":""},{"$f":"IF($M$1=\"\",\"\",IF($D109=$M$1,Eingabe!C106,\"\"))","v":""},{"$f":"IF(Eingabe!$A106=$M$1,$M$1,\"\")","v":""},{"$f":"IF($M$1=\"\",\"\",IF($D109=$M$1,Eingabe!G106,\"\"))","v":""}]
[105,{"$f":"IF($M$1=\"\",\"\",IF($D110=$M$1,Eingabe!B107,\"\"))","v":""},{"$f":"IF($M$1=\"\",\"\",IF($D110=$M$1,Eingabe!C107,\"\"))","v":""},{"$f":"IF(Eingabe!$A107=$M$1,$M$1,\"\")","v":""},{"$f":"IF($M$1=\"\",\"\",IF($D110=$M$1,Eingabe!G107,\"\"))","v":""}]
[106,{"$f":"IF($M$1=\"\",\"\",IF($D111=$M$1,Eingabe!B108,\"\"))","v":""},{"$f":"IF($M$1=\"\",\"\",IF($D111=$M$1,Eingabe!C108,\"\"))","v":""},{"$f":"IF(Eingabe!$A108=$M$1,$M$1,\"\")","v":""},{"$f":"IF($M$1=\"\",\"\",IF($D111=$M$1,Eingabe!G108,\"\"))","v":""}]
[107,{"$f":"IF($M$1=\"\",\"\",IF($D112=$M$1,Eingabe!B109,\"\"))","v":""},{"$f":"IF($M$1=\"\",\"\",IF($D112=$M$1,Eingabe!C109,\"\"))","v":""},{"$f":"IF(Eingabe!$A109=$M$1,$M$1,\"\")","v":""},{"$f":"IF($M$1=\"\",\"\",IF($D112=$M$1,Eingabe!G109,\"\"))","v":""}]
[108,{"$f":"IF($M$1=\"\",\"\",IF($D113=$M$1,Eingabe!B110,\"\"))","v":""},{"$f":"IF($M$1=\"\",\"\",IF($D113=$M$1,Eingabe!C110,\"\"))","v":""},{"$f":"IF(Eingabe!$A110=$M$1,$M$1,\"\")","v":""},{"$f":"IF($M$1=\"\",\"\",IF($D113=$M$1,Eingabe!G110,\"\"))","v":""}]
[109,{"$f":"IF($M$1=\"\",\"\",IF($D114=$M$1,Eingabe!B111,\"\"))","v":""},{"$f":"IF($M$1=\"\",\"\",IF($D114=$M$1,Eingabe!C111,\"\"))","v":""},{"$f":"IF(Eingabe!$A111=$M$1,$M$1,\"\")","v":""},{"$f":"IF($M$1=\"\",\"\",IF($D114=$M$1,Eingabe!G111,\"\"))","v":""}]
[110,{"$f":"IF($M$1=\"\",\"\",IF($D115=$M$1,Eingabe!B112,\"\"))","v":""},{"$f":"IF($M$1=\"\",\"\",IF($D115=$M$1,Eingabe!C112,\"\"))","v":""},{"$f":"IF(Eingabe!$A112=$M$1,$M$1,\"\")","v":""},{"$f":"IF($M$1=\"\",\"\",IF($D115=$M$1,Eingabe!G112,\"\"))","v":""}]
[111,{"$f":"IF($M$1=\"\",\"\",IF($D116=$M$1,Eingabe!B113,\"\"))","v":""},{"$f":"IF($M$1=\"\",\"\",IF($D116=$M$1,Eingabe!C113,\"\"))","v":""},{"$f":"IF(Eingabe!$A113=$M$1,$M$1,\"\")","v":""},{"$f":"IF($M$1=\"\",\"\",IF($D116=$M$1,Eingabe!G113,\"\"))","v":""}]
[112,{"$f":"IF($M$1=\"\",\"\",IF($D117=$M$1,Eingabe!B114,\"\"))","v":""},{"$f":"IF($M$1=\"\",\"\",IF($D117=$M$1,Eingabe!C114,\"\"))","v":""},{"$f":"IF(Eingabe!$A114=$M$1,$M$1,\"\")","v":""},{"$f":"IF($M$1=\"\",\"\",IF($D117=$M$1,Eingabe!G114,\"\"))","v":""}]
[113,{"$f":"IF($M$1=\"\",\"\",IF($D118=$M$1,Eingabe!B115,\"\"))","v":""},{"$f":"IF($M$1=\"\",\"\",IF($D118=$M$1,Eingabe!C115,\"\"))","v":""},{"$f":"IF(Eingabe!$A115=$M$1,$M$1,\"\")","v":""},{"$f":"IF($M$1=\"\",\"\",IF($D118=$M$1,Eingabe!G115,\"\"))","v":""}]
[114,{"$f":"IF($M$1=\"\",\"\",IF($D119=$M$1,Eingabe!B116,\"\"))","v":""},{"$f":"IF($M$1=\"\",\"\",IF($D119=$M$1,Eingabe!C116,\"\"))","v":""},{"$f":"IF(Eingabe!$A116=$M$1,$M$1,\"\")","v":""},{"$f":"IF($M$1=\"\",\"\",IF($D119=$M$1,Eingabe!G116,\"\"))","v":""}]
[115,{"$f":"IF($M$1=\"\",\"\",IF($D120=$M$1,Eingabe!B117,\"\"))","v":""},{"$f":"IF($M$1=\"\",\"\",IF($D120=$M$1,Eingabe!C117,\"\"))","v":""},{"$f":"IF(Eingabe!$A117=$M$1,$M$1,\"\")","v":""},{"$f":"IF($M$1=\"\",\"\",IF($D120=$M$1,Eingabe!G117,\"\"))","v":""}]
[116,{"$f":"IF($M$1=\"\",\"\",IF($D121=$M$1,Eingabe!B118,\"\"))","v":""},{"$f":"IF($M$1=\"\",\"\",IF($D121=$M$1,Eingabe!C118,\"\"))","v":""},{"$f":"IF(Eingabe!$A118=$M$1,$M$1,\"\")","v":""},{"$f":"IF($M$1=\"\",\"\",IF($D121=$M$1,Eingabe!G118,\"\"))","v":""}]
[117,{"$f":"IF($M$1=\"\",\"\",IF($D122=$M$1,Eingabe!B119,\"\"))","v":""},{"$f":"IF($M$1=\"\",\"\",IF($D122=$M$1,Eingabe!C119,\"\"))","v":""},{"$f":"IF(Eingabe!$A119=$M$1,$M$1,\"\")","v":""},{"$f":"IF($M$1=\"\",\"\",IF($D122=$M$1,Eingabe!G119,\"\"))","v":""}]
[118,{"$f":"IF($M$1=\"\",\"\",IF($D123=$M$1,Eingabe!B120,\"\"))","v":""},{"$f":"IF($M$1=\"\",\"\",IF($D123=$M$1,Eingabe!C120,\"\"))","v":""},{"$f":"IF(Eingabe!$A120=$M$1,$M$1,\"\")","v":""},{"$f":"IF($M$1=\"\",\"\",IF($D123=$M$1,Eingabe!G120,\"\"))","v":""}]
[119,{"$f":"IF($M$1=\"\",\"\",IF($D124=$M$1,Eingabe!B121,\"\"))","v":""},{"$f":"IF($M$1=\"\",\"\",IF($D124=$M$1,Eingabe!C121,\"\"))","v":""},{"$f":"IF(Eingabe!$A121=$M$1,$M$1,\"\")","v":""},{"$f":"IF($M$1=\"\",\"\",IF($D124=$M$1,Eingabe!G121,\"\"))","v":""}]
[120,{"$f":"IF($M$1=\"\",\"\",IF($D125=$M$1,Eingabe!B122,\"\"))","v":""},{"$f":"IF($M$1=\"\",\"\",IF($D125=$M$1,Eingabe!C122,\"\"))","v":""},{"$f":"IF(Eingabe!$A122=$M$1,$M$1,\"\")","v":""},{"$f":"IF($M$1=\"\",\"\",IF($D125=$M$1,Eingabe!G122,\"\"))","v":""}]
[121,{"$f":"IF($M$1=\"\",\"\",IF($D126=$M$1,Eingabe!B123,\"\"))","v":""},{"$f":"IF($M$1=\"\",\"\",IF($D126=$M$1,Eingabe!C123,\"\"))","v":""},{"$f":"IF(Eingabe!$A123=$M$1,$M$1,\"\")","v":""},{"$f":"IF($M$1=\"\",\"\",IF($D126=$M$1,Eingabe!G123,\"\"))","v":""}]
[122,{"$f":"IF($M$1=\"\",\"\",IF($D127=$M$1,Eingabe!B124,\"\"))","v":""},{"$f":"IF($M$1=\"\",\"\",IF($D127=$M$1,Eingabe!C124,\"\"))","v":""},{"$f":"IF(Eingabe!$A124=$M$1,$M$1,\"\")","v":""},{"$f":"IF($M$1=\"\",\"\",IF($D127=$M$1,Eingabe!G124,\"\"))","v":""}]
[123,{"$f":"IF($M$1=\"\",\"\",IF($D128=$M$1,Eingabe!B125,\"\"))","v":""},{"$f":"IF($M$1=\"\",\"\",IF($D128=$M$1,Eingabe!C125,\"\"))","v":""},{"$f":"IF(Eingabe!$A125=$M$1,$M$1,\"\")","v":""},{"$f":"IF($M$1=\"\",\"\",IF($D128=$M$1,Eingabe!G125,\"\"))","v":""}]
[124,{"$f":"IF($M$1=\"\",\"\",IF($D129=$M$1,Eingabe!B126,\"\"))","v":""},{"$f":"IF($M$1=\"\",\"\",IF($D129=$M$1,Eingabe!C126,\"\"))","v":""},{"$f":"IF(Eingabe!$A126=$M$1,$M$1,\"\")","v":""},{"$f":"IF($M$1=\"\",\"\",IF($D129=$M$1,Eingabe!G126,\"\"))","v":""}]
[125,{"$f":"IF($M$1=\"\",\"\",IF($D130=$M$1,Eingabe!B127,\"\"))","v":""},{"$f":"IF($M$1=\"\",\"\",IF($D130=$M$1,Eingabe!C127,\"\"))","v":""},{"$f":"IF(Eingabe!$A127=$M$1,$M$1,\"\")","v":""},{"$f":"IF($M$1=\"\",\"\",IF($D130=$M$1,Eingabe!G127,\"\"))","v":""}]
[126,{"$f":"IF($M$1=\"\",\"\",IF($D131=$M$1,Eingabe!B128,\"\"))","v":""},{"$f":"IF($M$1=\"\",\"\",IF($D131=$M$1,Eingabe!C128,\"\"))","v":""},{"$f":"IF(Eingabe!$A128=$M$1,$M$1,\"\")","v":""},{"$f":"IF($M$1=\"\",\"\",IF($D131=$M$1,Eingabe!G128,\"\"))","v":""}]
[127,{"$f":"IF($M$1=\"\",\"\",IF($D132=$M$1,Eingabe!B129,\"\"))","v":""},{"$f":"IF($M$1=\"\",\"\",IF($D132=$M$1,Eingabe!C129,\"\"))","v":""},{"$f":"IF(Eingabe!$A129=$M$1,$M$1,\"\")","v":""},{"$f":"IF($M$1=\"\",\"\",IF($D132=$M$1,Eingabe!G129,\"\"))","v":""}]
[128,{"$f":"IF($M$1=\"\",\"\",IF($D133=$M$1,Eingabe!B130,\"\"))","v":""},{"$f":"IF($M$1=\"\",\"\",IF($D133=$M$1,Eingabe!C130,\"\"))","v":""},{"$f":"IF(Eingabe!$A130=$M$1,$M$1,\"\")","v":""},{"$f":"IF($M$1=\"\",\"\",IF($D133=$M$1,Eingabe!G130,\"\"))","v":""}]
[129,{"$f":"IF($M$1=\"\",\"\",IF($D134=$M$1,Eingabe!B131,\"\"))","v":""},{"$f":"IF($M$1=\"\",\"\",IF($D134=$M$1,Eingabe!C131,\"\"))","v":""},{"$f":"IF(Eingabe!$A131=$M$1,$M$1,\"\")","v":""},{"$f":"IF($M$1=\"\",\"\",IF($D134=$M$1,Eingabe!G131,\"\"))","v":""}]
[130,{"$f":"IF($M$1=\"\",\"\",IF($D135=$M$1,Eingabe!B132,\"\"))","v":""},{"$f":"IF($M$1=\"\",\"\",IF($D135=$M$1,Eingabe!C132,\"\"))","v":""},{"$f":"IF(Eingabe!$A132=$M$1,$M$1,\"\")","v":""},{"$f":"IF($M$1=\"\",\"\",IF($D135=$M$1,Eingabe!G132,\"\"))","v":""}]
[131,{"$f":"IF($M$1=\"\",\"\",IF($D136=$M$1,Eingabe!B133,\"\"))","v":""},{"$f":"IF($M$1=\"\",\"\",IF($D136=$M$1,Eingabe!C133,\"\"))","v":""},{"$f":"IF(Eingabe!$A133=$M$1,$M$1,\"\")","v":""},{"$f":"IF($M$1=\"\",\"\",IF($D136=$M$1,Eingabe!G133,\"\"))","v":""}]
[132,{"$f":"IF($M$1=\"\",\"\",IF($D137=$M$1,Eingabe!B134,\"\"))","v":""},{"$f":"IF($M$1=\"\",\"\",IF($D137=$M$1,Eingabe!C134,\"\"))","v":""},{"$f":"IF(Eingabe!$A134=$M$1,$M$1,\"\")","v":""},{"$f":"IF($M$1=\"\",\"\",IF($D137=$M$1,Eingabe!G134,\"\"))","v":""}]
[133,{"$f":"IF($M$1=\"\",\"\",IF($D138=$M$1,Eingabe!B135,\"\"))","v":""},{"$f":"IF($M$1=\"\",\"\",IF($D138=$M$1,Eingabe!C135,\"\"))","v":""},{"$f":"IF(Eingabe!$A135=$M$1,$M$1,\"\")","v":""},{"$f":"IF($M$1=\"\",\"\",IF($D138=$M$1,Eingabe!G135,\"\"))","v":""}]
[134,{"$f":"IF($M$1=\"\",\"\",IF($D139=$M$1,Eingabe!B136,\"\"))","v":""},{"$f":"IF($M$1=\"\",\"\",IF($D139=$M$1,Eingabe!C136,\"\"))","v":""},{"$f":"IF(Eingabe!$A136=$M$1,$M$1,\"\")","v":""},{"$f":"IF($M$1=\"\",\"\",IF($D139=$M$1,Eingabe!G136,\"\"))","v":""}]
[135,{"$f":"IF($M$1=\"\",\"\",IF($D140=$M$1,Eingabe!B137,\"\"))","v":""},{"$f":"IF($M$1=\"\",\"\",IF($D140=$M$1,Eingabe!C137,\"\"))","v":""},{"$f":"IF(Eingabe!$A137=$M$1,$M$1,\"\")","v":""},{"$f":"IF($M$1=\"\",\"\",IF($D140=$M$1,Eingabe!G137,\"\"))","v":""}]
[136,{"$f":"IF($M$1=\"\",\"\",IF($D141=$M$1,Eingabe!B138,\"\"))","v":""},{"$f":"IF($M$1=\"\",\"\",IF($D141=$M$1,Eingabe!C138,\"\"))","v":""},{"$f":"IF(Eingabe!$A138=$M$1,$M$1,\"\")","v":""},{"$f":"IF($M$1=\"\",\"\",IF($D141=$M$1,Eingabe!G138,\"\"))","v":""}]
[137,{"$f":"IF($M$1=\"\",\"\",IF($D142=$M$1,Eingabe!B139,\"\"))","v":""},{"$f":"IF($M$1=\"\",\"\",IF($D142=$M$1,Eingabe!C139,\"\"))","v":""},{"$f":"IF(Eingabe!$A139=$M$1,$M$1,\"\")","v":""},{"$f":"IF($M$1=\"\",\"\",IF($D142=$M$1,Eingabe!G139,\"\"))","v":""}]
[138,{"$f":"IF($M$1=\"\",\"\",IF($D143=$M$1,Eingabe!B140,\"\"))","v":""},{"$f":"IF($M$1=\"\",\"\",IF($D143=$M$1,Eingabe!C140,\"\"))","v":""},{"$f":"IF(Eingabe!$A140=$M$1,$M$1,\"\")","v":""},{"$f":"IF($M$1=\"\",\"\",IF($D143=$M$1,Eingabe!G140,\"\"))","v":""}]
[139,{"$f":"IF($M$1=\"\",\"\",IF($D144=$M$1,Eingabe!B141,\"\"))","v":""},{"$f":"IF($M$1=\"\",\"\",IF($D144=$M$1,Eingabe!C141,\"\"))","v":""},{"$f":"IF(Eingabe!$A141=$M$1,$M$1,\"\")","v":""},{"$f":"IF($M$1=\"\",\"\",IF($D144=$M$1,Eingabe!G141,\"\"))","v":""}]
[140,{"$f":"IF($M$1=\"\",\"\",IF($D145=$M$1,Eingabe!B142,\"\"))","v":""},{"$f":"IF($M$1=\"\",\"\",IF($D145=$M$1,Eingabe!C142,\"\"))","v":""},{"$f":"IF(Eingabe!$A142=$M$1,$M$1,\"\")","v":""},{"$f":"IF($M$1=\"\",\"\",IF($D145=$M$1,Eingabe!G142,\"\"))","v":""}]
[141,{"$f":"IF($M$1=\"\",\"\",IF($D146=$M$1,Eingabe!B143,\"\"))","v":""},{"$f":"IF($M$1=\"\",\"\",IF($D146=$M$1,Eingabe!C143,\"\"))","v":""},{"$f":"IF(Eingabe!$A143=$M$1,$M$1,\"\")","v":""},{"$f":"IF($M$1=\"\",\"\",IF($D146=$M$1,Eingabe!G143,\"\"))","v":""}]
[142,{"$f":"IF($M$1=\"\",\"\",IF($D147=$M$1,Eingabe!B144,\"\"))","v":""},{"$f":"IF($M$1=\"\",\"\",IF($D147=$M$1,Eingabe!C144,\"\"))","v":""},{"$f":"IF(Eingabe!$A144=$M$1,$M$1,\"\")","v":""},{"$f":"IF($M$1=\"\",\"\",IF($D147=$M$1,Eingabe!G144,\"\"))","v":""}]
[143,{"$f":"IF($M$1=\"\",\"\",IF($D148=$M$1,Eingabe!B145,\"\"))","v":""},{"$f":"IF($M$1=\"\",\"\",IF($D148=$M$1,Eingabe!C145,\"\"))","v":""},{"$f":"IF(Eingabe!$A145=$M$1,$M$1,\"\")","v":""},{"$f":"IF($M$1=\"\",\"\",IF($D148=$M$1,Eingabe!G145,\"\"))","v":""}]
[144,{"$f":"IF($M$1=\"\",\"\",IF($D149=$M$1,Eingabe!B146,\"\"))","v":""},{"$f":"IF($M$1=\"\",\"\",IF($D149=$M$1,Eingabe!C146,\"\"))","v":""},{"$f":"IF(Eingabe!$A146=$M$1,$M$1,\"\")","v":""},{"$f":"IF($M$1=\"\",\"\",IF($D149=$M$1,Eingabe!G146,\"\"))","v":""}]
[145,{"$f":"IF($M$1=\"\",\"\",IF($D150=$M$1,Eingabe!B147,\"\"))","v":""},{"$f":"IF($M$1=\"\",\"\",IF($D150=$M$1,Eingabe!C147,\"\"))","v":""},{"$f":"IF(Eingabe!$A147=$M$1,$M$1,\"\")","v":""},{"$f":"IF($M$1=\"\",\"\",IF($D150=$M$1,Eingabe!G147,\"\"))","v":""}]
[146,{"$f":"IF($M$1=\"\",\"\",IF($D151=$M$1,Eingabe!B148,\"\"))","v":""},{"$f":"IF($M$1=\"\",\"\",IF($D151=$M$1,Eingabe!C148,\"\"))","v":""},{"$f":"IF(Eingabe!$A148=$M$1,$M$1,\"\")","v":""},{"$f":"IF($M$1=\"\",\"\",IF($D151=$M$1,Eingabe!G148,\"\"))","v":""}]
[147,{"$f":"IF($M$1=\"\",\"\",IF($D152=$M$1,Eingabe!B149,\"\"))","v":""},{"$f":"IF($M$1=\"\",\"\",IF($D152=$M$1,Eingabe!C149,\"\"))","v":""},{"$f":"IF(Eingabe!$A149=$M$1,$M$1,\"\")","v":""},{"$f":"IF($M$1=\"\",\"\",IF($D152=$M$1,Eingabe!G149,\"\"))","v":""}]
[148,{"$f":"IF($M$1=\"\",\"\",IF($D153=$M$1,Eingabe!B150,\"\"))","v":""},{"$f":"IF($M$1=\"\",\"\",IF($D153=$M$1,Eingabe!C150,\"\"))","v":""},{"$f":"IF(Eingabe!$A150=$M$1,$M$1,\"\")","v":""},{"$f":"IF($M$1=\"\",\"\",IF($D153=$M$1,Eingabe!G150,\"\"))","v":""}]
[149,{"$f":"IF($M$1=\"\",\"\",IF($D154=$M$1,Eingabe!B151,\"\"))","v":""},{"$f":"IF($M$1=\"\",\"\",IF($D154=$M$1,Eingabe!C151,\"\"))","v":""},{"$f":"IF(Eingabe!$A151=$M$1,$M$1,\"\")","v":""},{"$f":"IF($M$1=\"\",\"\",IF($D154=$M$1,Eingabe!G151,\"\"))","v":""}]
[150,{"$f":"IF($M$1=\"\",\"\",IF($D155=$M$1,Eingabe!B152,\"\"))","v":""},{"$f":"IF($M$1=\"\",\"\",IF($D155=$M$1,Eingabe!C152,\"\"))","v":""},{"$f":"IF(Eingabe!$A152=$M$1,$M$1,\"\")","v":""},{"$f":"IF($M$1=\"\",\"\",IF($D155=$M$1,Eingabe!G152,\"\"))","v":""}]
[151,{"$f":"IF($M$1=\"\",\"\",IF($D156=$M$1,Eingabe!B153,\"\"))","v":""},{"$f":"IF($M$1=\"\",\"\",IF($D156=$M$1,Eingabe!C153,\"\"))","v":""},{"$f":"IF(Eingabe!$A153=$M$1,$M$1,\"\")","v":""},{"$f":"IF($M$1=\"\",\"\",IF($D156=$M$1,Eingabe!G153,\"\"))","v":""}]
[152,{"$f":"IF($M$1=\"\",\"\",IF($D157=$M$1,Eingabe!B154,\"\"))","v":""},{"$f":"IF($M$1=\"\",\"\",IF($D157=$M$1,Eingabe!C154,\"\"))","v":""},{"$f":"IF(Eingabe!$A154=$M$1,$M$1,\"\")","v":""},{"$f":"IF($M$1=\"\",\"\",IF($D157=$M$1,Eingabe!G154,\"\"))","v":""}]
[153,{"$f":"IF($M$1=\"\",\"\",IF($D158=$M$1,Eingabe!B155,\"\"))","v":""},{"$f":"IF($M$1=\"\",\"\",IF($D158=$M$1,Eingabe!C155,\"\"))","v":""},{"$f":"IF(Eingabe!$A155=$M$1,$M$1,\"\")","v":""},{"$f":"IF($M$1=\"\",\"\",IF($D158=$M$1,Eingabe!G155,\"\"))","v":""}]
[154,{"$f":"IF($M$1=\"\",\"\",IF($D159=$M$1,Eingabe!B156,\"\"))","v":""},{"$f":"IF($M$1=\"\",\"\",IF($D159=$M$1,Eingabe!C156,\"\"))","v":""},{"$f":"IF(Eingabe!$A156=$M$1,$M$1,\"\")","v":""},{"$f":"IF($M$1=\"\",\"\",IF($D159=$M$1,Eingabe!G156,\"\"))","v":""}]
[155,{"$f":"IF($M$1=\"\",\"\",IF($D160=$M$1,Eingabe!B157,\"\"))","v":""},{"$f":"IF($M$1=\"\",\"\",IF($D160=$M$1,Eingabe!C157,\"\"))","v":""},{"$f":"IF(Eingabe!$A157=$M$1,$M$1,\"\")","v":""},{"$f":"IF($M$1=\"\",\"\",IF($D160=$M$1,Eingabe!G157,\"\"))","v":""}]
[156,{"$f":"IF($M$1=\"\",\"\",IF($D161=$M$1,Eingabe!B158,\"\"))","v":""},{"$f":"IF($M$1=\"\",\"\",IF($D161=$M$1,Eingabe!C158,\"\"))","v":""},{"$f":"IF(Eingabe!$A158=$M$1,$M$1,\"\")","v":""},{"$f":"IF($M$1=\"\",\"\",IF($D161=$M$1,Eingabe!G158,\"\"))","v":""}]
[157,{"$f":"IF($M$1=\"\",\"\",IF($D162=$M$1,Eingabe!B159,\"\"))","v":""},{"$f":"IF($M$1=\"\",\"\",IF($D162=$M$1,Eingabe!C159,\"\"))","v":""},{"$f":"IF(Eingabe!$A159=$M$1,$M$1,\"\")","v":""},{"$f":"IF($M$1=\"\",\"\",IF($D162=$M$1,Eingabe!G159,\"\"))","v":""}]
[158,{"$f":"IF($M$1=\"\",\"\",IF($D163=$M$1,Eingabe!B160,\"\"))","v":""},{"$f":"IF($M$1=\"\",\"\",IF($D163=$M$1,Eingabe!C160,\"\"))","v":""},{"$f":"IF(Eingabe!$A160=$M$1,$M$1,\"\")","v":""},{"$f":"IF($M$1=\"\",\"\",IF($D163=$M$1,Eingabe!G160,\"\"))","v":""}]
[159,{"$f":"IF($M$1=\"\",\"\",IF($D164=$M$1,Eingabe!B161,\"\"))","v":""},{"$f":"IF($M$1=\"\",\"\",IF($D164=$M$1,Eingabe!C161,\"\"))","v":""},{"$f":"IF(Eingabe!$A161=$M$1,$M$1,\"\")","v":""},{"$f":"IF($M$1=\"\",\"\",IF($D164=$M$1,Eingabe!G161,\"\"))","v":""}]
[160,{"$f":"IF($M$1=\"\",\"\",IF($D165=$M$1,Eingabe!B162,\"\"))","v":""},{"$f":"IF($M$1=\"\",\"\",IF($D165=$M$1,Eingabe!C162,\"\"))","v":""},{"$f":"IF(Eingabe!$A162=$M$1,$M$1,\"\")","v":""},{"$f":"IF($M$1=\"\",\"\",IF($D165=$M$1,Eingabe!G162,\"\"))","v":""}]
[161,{"$f":"IF($M$1=\"\",\"\",IF($D166=$M$1,Eingabe!B163,\"\"))","v":""},{"$f":"IF($M$1=\"\",\"\",IF($D166=$M$1,Eingabe!C163,\"\"))","v":""},{"$f":"IF(Eingabe!$A163=$M$1,$M$1,\"\")","v":""},{"$f":"IF($M$1=\"\",\"\",IF($D166=$M$1,Eingabe!G163,\"\"))","v":""}]
[162,{"$f":"IF($M$1=\"\",\"\",IF($D167=$M$1,Eingabe!B164,\"\"))","v":""},{"$f":"IF($M$1=\"\",\"\",IF($D167=$M$1,Eingabe!C164,\"\"))","v":""},{"$f":"IF(Eingabe!$A164=$M$1,$M$1,\"\")","v":""},{"$f":"IF($M$1=\"\",\"\",IF($D167=$M$1,Eingabe!G164,\"\"))","v":""}]
[163,{"$f":"IF($M$1=\"\",\"\",IF($D168=$M$1,Eingabe!B165,\"\"))","v":""},{"$f":"IF($M$1=\"\",\"\",IF($D168=$M$1,Eingabe!C165,\"\"))","v":""},{"$f":"IF(Eingabe!$A165=$M$1,$M$1,\"\")","v":""},{"$f":"IF($M$1=\"\",\"\",IF($D168=$M$1,Eingabe!G165,\"\"))","v":""}]
[164,{"$f":"IF($M$1=\"\",\"\",IF($D169=$M$1,Eingabe!B166,\"\"))","v":""},{"$f":"IF($M$1=\"\",\"\",IF($D169=$M$1,Eingabe!C166,\"\"))","v":""},{"$f":"IF(Eingabe!$A166=$M$1,$M$1,\"\")","v":""},{"$f":"IF($M$1=\"\",\"\",IF($D169=$M$1,Eingabe!G166,\"\"))","v":""}]
[165,{"$f":"IF($M$1=\"\",\"\",IF($D170=$M$1,Eingabe!B167,\"\"))","v":""},{"$f":"IF($M$1=\"\",\"\",IF($D170=$M$1,Eingabe!C167,\"\"))","v":""},{"$f":"IF(Eingabe!$A167=$M$1,$M$1,\"\")","v":""},{"$f":"IF($M$1=\"\",\"\",IF($D170=$M$1,Eingabe!G167,\"\"))","v":""}]
[166,{"$f":"IF($M$1=\"\",\"\",IF($D171=$M$1,Eingabe!B168,\"\"))","v":""},{"$f":"IF($M$1=\"\",\"\",IF($D171=$M$1,Eingabe!C168,\"\"))","v":""},{"$f":"IF(Eingabe!$A168=$M$1,$M$1,\"\")","v":""},{"$f":"IF($M$1=\"\",\"\",IF($D171=$M$1,Eingabe!G168,\"\"))","v":""}]
[167,{"$f":"IF($M$1=\"\",\"\",IF($D172=$M$1,Eingabe!B169,\"\"))","v":""},{"$f":"IF($M$1=\"\",\"\",IF($D172=$M$1,Eingabe!C169,\"\"))","v":""},{"$f":"IF(Eingabe!$A169=$M$1,$M$1,\"\")","v":""},{"$f":"IF($M$1=\"\",\"\",IF($D172=$M$1,Eingabe!G169,\"\"))","v":""}]
[168,{"$f":"IF($M$1=\"\",\"\",IF($D173=$M$1,Eingabe!B170,\"\"))","v":""},{"$f":"IF($M$1=\"\",\"\",IF($D173=$M$1,Eingabe!C170,\"\"))","v":""},{"$f":"IF(Eingabe!$A170=$M$1,$M$1,\"\")","v":""},{"$f":"IF($M$1=\"\",\"\",IF($D173=$M$1,Eingabe!G170,\"\"))","v":""}]
[169,{"$f":"IF($M$1=\"\",\"\",IF($D174=$M$1,Eingabe!B171,\"\"))","v":""},{"$f":"IF($M$1=\"\",\"\",IF($D174=$M$1,Eingabe!C171,\"\"))","v":""},{"$f":"IF(Eingabe!$A171=$M$1,$M$1,\"\")","v":""},{"$f":"IF($M$1=\"\",\"\",IF($D174=$M$1,Eingabe!G171,\"\"))","v":""}]
[170,{"$f":"IF($M$1=\"\",\"\",IF($D175=$M$1,Eingabe!B172,\"\"))","v":""},{"$f":"IF($M$1=\"\",\"\",IF($D175=$M$1,Eingabe!C172,\"\"))","v":""},{"$f":"IF(Eingabe!$A172=$M$1,$M$1,\"\")","v":""},{"$f":"IF($M$1=\"\",\"\",IF($D175=$M$1,Eingabe!G172,\"\"))","v":""}]
[171,{"$f":"IF($M$1=\"\",\"\",IF($D176=$M$1,Eingabe!B173,\"\"))","v":""},{"$f":"IF($M$1=\"\",\"\",IF($D176=$M$1,Eingabe!C173,\"\"))","v":""},{"$f":"IF(Eingabe!$A173=$M$1,$M$1,\"\")","v":""},{"$f":"IF($M$1=\"\",\"\",IF($D176=$M$1,Eingabe!G173,\"\"))","v":""}]
[172,{"$f":"IF($M$1=\"\",\"\",IF($D177=$M$1,Eingabe!B174,\"\"))","v":""},{"$f":"IF($M$1=\"\",\"\",IF($D177=$M$1,Eingabe!C174,\"\"))","v":""},{"$f":"IF(Eingabe!$A174=$M$1,$M$1,\"\")","v":""},{"$f":"IF($M$1=\"\",\"\",IF($D177=$M$1,Eingabe!G174,\"\"))","v":""}]
[173,{"$f":"IF($M$1=\"\",\"\",IF($D178=$M$1,Eingabe!B175,\"\"))","v":""},{"$f":"IF($M$1=\"\",\"\",IF($D178=$M$1,Eingabe!C175,\"\"))","v":""},{"$f":"IF(Eingabe!$A175=$M$1,$M$1,\"\")","v":""},{"$f":"IF($M$1=\"\",\"\",IF($D178=$M$1,Eingabe!G175,\"\"))","v":""}]
[174,{"$f":"IF($M$1=\"\",\"\",IF($D179=$M$1,Eingabe!B176,\"\"))","v":""},{"$f":"IF($M$1=\"\",\"\",IF($D179=$M$1,Eingabe!C176,\"\"))","v":""},{"$f":"IF(Eingabe!$A176=$M$1,$M$1,\"\")","v":""},{"$f":"IF($M$1=\"\",\"\",IF($D179=$M$1,Eingabe!G176,\"\"))","v":""}]
[175,{"$f":"IF($M$1=\"\",\"\",IF($D180=$M$1,Eingabe!B177,\"\"))","v":""},{"$f":"IF($M$1=\"\",\"\",IF($D180=$M$1,Eingabe!C177,\"\"))","v":""},{"$f":"IF(Eingabe!$A177=$M$1,$M$1,\"\")","v":""},{"$f":"IF($M$1=\"\",\"\",IF($D180=$M$1,Eingabe!G177,\"\"))","v":""}]
[176,{"$f":"IF($M$1=\"\",\"\",IF($D181=$M$1,Eingabe!B178,\"\"))","v":""},{"$f":"IF($M$1=\"\",\"\",IF($D181=$M$1,Eingabe!C178,\"\"))","v":""},{"$f":"IF(Eingabe!$A178=$M$1,$M$1,\"\")","v":""},{"$f":"IF($M$1=\"\",\"\",IF($D181=$M$1,Eingabe!G178,\"\"))","v":""}]
[177,{"$f":"IF($M$1=\"\",\"\",IF($D182=$M$1,Eingabe!B179,\"\"))","v":""},{"$f":"IF($M$1=\"\",\"\",IF($D182=$M$1,Eingabe!C179,\"\"))","v":""},{"$f":"IF(Eingabe!$A179=$M$1,$M$1,\"\")","v":""},{"$f":"IF($M$1=\"\",\"\",IF($D182=$M$1,Eingabe!G179,\"\"))","v":""}]
[178,{"$f":"IF($M$1=\"\",\"\",IF($D183=$M$1,Eingabe!B180,\"\"))","v":""},{"$f":"IF($M$1=\"\",\"\",IF($D183=$M$1,Eingabe!C180,\"\"))","v":""},{"$f":"IF(Eingabe!$A180=$M$1,$M$1,\"\")","v":""},{"$f":"IF($M$1=\"\",\"\",IF($D183=$M$1,Eingabe!G180,\"\"))","v":""}]
[179,{"$f":"IF($M$1=\"\",\"\",IF($D184=$M$1,Eingabe!B181,\"\"))","v":""},{"$f":"IF($M$1=\"\",\"\",IF($D184=$M$1,Eingabe!C181,\"\"))","v":""},{"$f":"IF(Eingabe!$A181=$M$1,$M$1,\"\")","v":""},{"$f":"IF($M$1=\"\",\"\",IF($D184=$M$1,Eingabe!G181,\"\"))","v":""}]
[180,{"$f":"IF($M$1=\"\",\"\",IF($D185=$M$1,Eingabe!B182,\"\"))","v":""},{"$f":"IF($M$1=\"\",\"\",IF($D185=$M$1,Eingabe!C182,\"\"))","v":""},{"$f":"IF(Eingabe!$A182=$M$1,$M$1,\"\")","v":""},{"$f":"IF($M$1=\"\",\"\",IF($D185=$M$1,Eingabe!G182,\"\"))","v":""}]
[181,{"$f":"IF($M$1=\"\",\"\",IF($D186=$M$1,Eingabe!B183,\"\"))","v":""},{"$f":"IF($M$1=\"\",\"\",IF($D186=$M$1,Eingabe!C183,\"\"))","v":""},{"$f":"IF(Eingabe!$A183=$M$1,$M$1,\"\")","v":""},{"$f":"IF($M$1=\"\",\"\",IF($D186=$M$1,Eingabe!G183,\"\"))","v":""}]
[182,{"$f":"IF($M$1=\"\",\"\",IF($D187=$M$1,Eingabe!B184,\"\"))","v":""},{"$f":"IF($M$1=\"\",\"\",IF($D187=$M$1,Eingabe!C184,\"\"))","v":""},{"$f":"IF(Eingabe!$A184=$M$1,$M$1,\"\")","v":""},{"$f":"IF($M$1=\"\",\"\",IF($D187=$M$1,Eingabe!G184,\"\"))","v":""}]
[183,{"$f":"IF($M$1=\"\",\"\",IF($D188=$M$1,Eingabe!B185,\"\"))","v":""},{"$f":"IF($M$1=\"\",\"\",IF($D188=$M$1,Eingabe!C185,\"\"))","v":""},{"$f":"IF(Eingabe!$A185=$M$1,$M$1,\"\")","v":""},{"$f":"IF($M$1=\"\",\"\",IF($D188=$M$1,Eingabe!G185,\"\"))","v":""}]
[184,{"$f":"IF($M$1=\"\",\"\",IF($D189=$M$1,Eingabe!B186,\"\"))","v":""},{"$f":"IF($M$1=\"\",\"\",IF($D189=$M$1,Eingabe!C186,\"\"))","v":""},{"$f":"IF(Eingabe!$A186=$M$1,$M$1,\"\")","v":""},{"$f":"IF($M$1=\"\",\"\",IF($D189=$M$1,Eingabe!G186,\"\"))","v":""}]
[185,{"$f":"IF($M$1=\"\",\"\",IF($D190=$M$1,Eingabe!B187,\"\"))","v":""},{"$f":"IF($M$1=\"\",\"\",IF($D190=$M$1,Eingabe!C187,\"\"))","v":""},{"$f":"IF(Eingabe!$A187=$M$1,$M$1,\"\")","v":""},{"$f":"IF($M$1=\"\",\"\",IF($D190=$M$1,Eingabe!G187,\"\"))","v":""}]
[186,{"$f":"IF($M$1=\"\",\"\",IF($D191=$M$1,Eingabe!B188,\"\"))","v":""},{"$f":"IF($M$1=\"\",\"\",IF($D191=$M$1,Eingabe!C188,\"\"))","v":""},{"$f":"IF(Eingabe!$A188=$M$1,$M$1,\"\")","v":""},{"$f":"IF($M$1=\"\",\"\",IF($D191=$M$1,Eingabe!G188,\"\"))","v":""}]
[187,{"$f":"IF($M$1=\"\",\"\",IF($D192=$M$1,Eingabe!B189,\"\"))","v":""},{"$f":"IF($M$1=\"\",\"\",IF($D192=$M$1,Eingabe!C189,\"\"))","v":""},{"$f":"IF(Eingabe!$A189=$M$1,$M$1,\"\")","v":""},{"$f":"IF($M$1=\"\",\"\",IF($D192=$M$1,Eingabe!G189,\"\"))","v":""}]
[188,{"$f":"IF($M$1=\"\",\"\",IF($D193=$M$1,Eingabe!B190,\"\"))","v":""},{"$f":"IF($M$1=\"\",\"\",IF($D193=$M$1,Eingabe!C190,\"\"))","v":""},{"$f":"IF(Eingabe!$A190=$M$1,$M$1,\"\")","v":""},{"$f":"IF($M$1=\"\",\"\",IF($D193=$M$1,Eingabe!G190,\"\"))","v":""}]
[189,{"$f":"IF($M$1=\"\",\"\",IF($D194=$M$1,Eingabe!B191,\"\"))","v":""},{"$f":"IF($M$1=\"\",\"\",IF($D194=$M$1,Eingabe!C191,\"\"))","v":""},{"$f":"IF(Eingabe!$A191=$M$1,$M$1,\"\")","v":""},{"$f":"IF($M$1=\"\",\"\",IF($D194=$M$1,Eingabe!G191,\"\"))","v":""}]
[190,{"$f":"IF($M$1=\"\",\"\",IF($D195=$M$1,Eingabe!B192,\"\"))","v":""},{"$f":"IF($M$1=\"\",\"\",IF($D195=$M$1,Eingabe!C192,\"\"))","v":""},{"$f":"IF(Eingabe!$A192=$M$1,$M$1,\"\")","v":""},{"$f":"IF($M$1=\"\",\"\",IF($D195=$M$1,Eingabe!G192,\"\"))","v":""}]
[191,{"$f":"IF($M$1=\"\",\"\",IF($D196=$M$1,Eingabe!B193,\"\"))","v":""},{"$f":"IF($M$1=\"\",\"\",IF($D196=$M$1,Eingabe!C193,\"\"))","v":""},{"$f":"IF(Eingabe!$A193=$M$1,$M$1,\"\")","v":""},{"$f":"IF($M$1=\"\",\"\",IF($D196=$M$1,Eingabe!G193,\"\"))","v":""}]
[192,{"$f":"IF($M$1=\"\",\"\",IF($D197=$M$1,Eingabe!B194,\"\"))","v":""},{"$f":"IF($M$1=\"\",\"\",IF($D197=$M$1,Eingabe!C194,\"\"))","v":""},{"$f":"IF(Eingabe!$A194=$M$1,$M$1,\"\")","v":""},{"$f":"IF($M$1=\"\",\"\",IF($D197=$M$1,Eingabe!G194,\"\"))","v":""}]
[193,{"$f":"IF($M$1=\"\",\"\",IF($D198=$M$1,Eingabe!B195,\"\"))","v":""},{"$f":"IF($M$1=\"\",\"\",IF($D198=$M$1,Eingabe!C195,\"\"))","v":""},{"$f":"IF(Eingabe!$A195=$M$1,$M$1,\"\")","v":""},{"$f":"IF($M$1=\"\",\"\",IF($D198=$M$1,Eingabe!G195,\"\"))","v":""}]
[194,{"$f":"IF($M$1=\"\",\"\",IF($D199=$M$1,Eingabe!B196,\"\"))","v":""},{"$f":"IF($M$1=\"\",\"\",IF($D199=$M$1,Eingabe!C196,\"\"))","v":""},{"$f":"IF(Eingabe!$A196=$M$1,$M$1,\"\")","v":""},{"$f":"IF($M$1=\"\",\"\",IF($D199=$M$1,Eingabe!G196,\"\"))","v":""}]
[195,{"$f":"IF($M$1=\"\",\"\",IF($D200=$M$1,Eingabe!B197,\"\"))","v":""},{"$f":"IF($M$1=\"\",\"\",IF($D200=$M$1,Eingabe!C197,\"\"))","v":""},{"$f":"IF(Eingabe!$A197=$M$1,$M$1,\"\")","v":""},{"$f":"IF($M$1=\"\",\"\",IF($D200=$M$1,Eingabe!G197,\"\"))","v":""}]
[196,{"$f":"IF($M$1=\"\",\"\",IF($D201=$M$1,Eingabe!B198,\"\"))","v":""},{"$f":"IF($M$1=\"\",\"\",IF($D201=$M$1,Eingabe!C198,\"\"))","v":""},{"$f":"IF(Eingabe!$A198=$M$1,$M$1,\"\")","v":""},{"$f":"IF($M$1=\"\",\"\",IF($D201=$M$1,Eingabe!G198,\"\"))","v":""}]
[197,{"$f":"IF($M$1=\"\",\"\",IF($D202=$M$1,Eingabe!B199,\"\"))","v":""},{"$f":"IF($M$1=\"\",\"\",IF($D202=$M$1,Eingabe!C199,\"\"))","v":""},{"$f":"IF(Eingabe!$A199=$M$1,$M$1,\"\")","v":""},{"$f":"IF($M$1=\"\",\"\",IF($D202=$M$1,Eingabe!G199,\"\"))","v":""}]
[198,{"$f":"IF($M$1=\"\",\"\",IF($D203=$M$1,Eingabe!B200,\"\"))","v":""},{"$f":"IF($M$1=\"\",\"\",IF($D203=$M$1,Eingabe!C200,\"\"))","v":""},{"$f":"IF(Eingabe!$A200=$M$1,$M$1,\"\")","v":""},{"$f":"IF($M$1=\"\",\"\",IF($D203=$M$1,Eingabe!G200,\"\"))","v":""}]
[199,{"$f":"IF($M$1=\"\",\"\",IF($D204=$M$1,Eingabe!B201,\"\"))","v":""},{"$f":"IF($M$1=\"\",\"\",IF($D204=$M$1,Eingabe!C201,\"\"))","v":""},{"$f":"IF(Eingabe!$A201=$M$1,$M$1,\"\")","v":""},{"$f":"IF($M$1=\"\",\"\",IF($D204=$M$1,Eingabe!G201,\"\"))","v":""}]
[200,{"$f":"IF($M$1=\"\",\"\",IF($D205=$M$1,Eingabe!B202,\"\"))","v":""},{"$f":"IF($M$1=\"\",\"\",IF($D205=$M$1,Eingabe!C202,\"\"))","v":""},{"$f":"IF(Eingabe!$A202=$M$1,$M$1,\"\")","v":""},{"$f":"IF($M$1=\"\",\"\",IF($D205=$M$1,Eingabe!G202,\"\"))","v":""}]
[201,{"$f":"IF($M$1=\"\",\"\",IF($D206=$M$1,Eingabe!B203,\"\"))","v":""},{"$f":"IF($M$1=\"\",\"\",IF($D206=$M$1,Eingabe!C203,\"\"))","v":""},{"$f":"IF(Eingabe!$A203=$M$1,$M$1,\"\")","v":""},{"$f":"IF($M$1=\"\",\"\",IF($D206=$M$1,Eingabe!G203,\"\"))","v":""}]
[202,{"$f":"IF($M$1=\"\",\"\",IF($D207=$M$1,Eingabe!B204,\"\"))","v":""},{"$f":"IF($M$1=\"\",\"\",IF($D207=$M$1,Eingabe!C204,\"\"))","v":""},{"$f":"IF(Eingabe!$A204=$M$1,$M$1,\"\")","v":""},{"$f":"IF($M$1=\"\",\"\",IF($D207=$M$1,Eingabe!G204,\"\"))","v":""}]
[203,{"$f":"IF($M$1=\"\",\"\",IF($D208=$M$1,Eingabe!B205,\"\"))","v":""},{"$f":"IF($M$1=\"\",\"\",IF($D208=$M$1,Eingabe!C205,\"\"))","v":""},{"$f":"IF(Eingabe!$A205=$M$1,$M$1,\"\")","v":""},{"$f":"IF($M$1=\"\",\"\",IF($D208=$M$1,Eingabe!G205,\"\"))","v":""}]
[204,{"$f":"IF($M$1=\"\",\"\",IF($D209=$M$1,Eingabe!B206,\"\"))","v":""},{"$f":"IF($M$1=\"\",\"\",IF($D209=$M$1,Eingabe!C206,\"\"))","v":""},{"$f":"IF(Eingabe!$A206=$M$1,$M$1,\"\")","v":""},{"$f":"IF($M$1=\"\",\"\",IF($D209=$M$1,Eingabe!G206,\"\"))","v":""}]
[205,{"$f":"IF($M$1=\"\",\"\",IF($D210=$M$1,Eingabe!B207,\"\"))","v":""},{"$f":"IF($M$1=\"\",\"\",IF($D210=$M$1,Eingabe!C207,\"\"))","v":""},{"$f":"IF(Eingabe!$A207=$M$1,$M$1,\"\")","v":""},{"$f":"IF($M$1=\"\",\"\",IF($D210=$M$1,Eingabe!G207,\"\"))","v":""}]
[206,{"$f":"IF($M$1=\"\",\"\",IF($D211=$M$1,Eingabe!B208,\"\"))","v":""},{"$f":"IF($M$1=\"\",\"\",IF($D211=$M$1,Eingabe!C208,\"\"))","v":""},{"$f":"IF(Eingabe!$A208=$M$1,$M$1,\"\")","v":""},{"$f":"IF($M$1=\"\",\"\",IF($D211=$M$1,Eingabe!G208,\"\"))","v":""}]
[207,{"$f":"IF($M$1=\"\",\"\",IF($D212=$M$1,Eingabe!B209,\"\"))","v":""},{"$f":"IF($M$1=\"\",\"\",IF($D212=$M$1,Eingabe!C209,\"\"))","v":""},{"$f":"IF(Eingabe!$A209=$M$1,$M$1,\"\")","v":""},{"$f":"IF($M$1=\"\",\"\",IF($D212=$M$1,Eingabe!G209,\"\"))","v":""}]
[208,{"$f":"IF($M$1=\"\",\"\",IF($D213=$M$1,Eingabe!B210,\"\"))","v":""},{"$f":"IF($M$1=\"\",\"\",IF($D213=$M$1,Eingabe!C210,\"\"))","v":""},{"$f":"IF(Eingabe!$A210=$M$1,$M$1,\"\")","v":""},{"$f":"IF($M$1=\"\",\"\",IF($D213=$M$1,Eingabe!G210,\"\"))","v":""}]
[209,{"$f":"IF($M$1=\"\",\"\",IF($D214=$M$1,Eingabe!B211,\"\"))","v":""},{"$f":"IF($M$1=\"\",\"\",IF($D214=$M$1,Eingabe!C211,\"\"))","v":""},{"$f":"IF(Eingabe!$A211=$M$1,$M$1,\"\")","v":""},{"$f":"IF($M$1=\"\",\"\",IF($D214=$M$1,Eingabe!G211,\"\"))","v":""}]
[210,{"$f":"IF($M$1=\"\",\"\",IF($D215=$M$1,Eingabe!B212,\"\"))","v":""},{"$f":"IF($M$1=\"\",\"\",IF($D215=$M$1,Eingabe!C212,\"\"))","v":""},{"$f":"IF(Eingabe!$A212=$M$1,$M$1,\"\")","v":""},{"$f":"IF($M$1=\"\",\"\",IF($D215=$M$1,Eingabe!G212,\"\"))","v":""}]
[211,{"$f":"IF($M$1=\"\",\"\",IF($D216=$M$1,Eingabe!B213,\"\"))","v":""},{"$f":"IF($M$1=\"\",\"\",IF($D216=$M$1,Eingabe!C213,\"\"))","v":""},{"$f":"IF(Eingabe!$A213=$M$1,$M$1,\"\")","v":""},{"$f":"IF($M$1=\"\",\"\",IF($D216=$M$1,Eingabe!G213,\"\"))","v":""}]
[212,{"$f":"IF($M$1=\"\",\"\",IF($D217=$M$1,Eingabe!B214,\"\"))","v":""},{"$f":"IF($M$1=\"\",\"\",IF($D217=$M$1,Eingabe!C214,\"\"))","v":""},{"$f":"IF(Eingabe!$A214=$M$1,$M$1,\"\")","v":""},{"$f":"IF($M$1=\"\",\"\",IF($D217=$M$1,Eingabe!G214,\"\"))","v":""}]
[213,{"$f":"IF($M$1=\"\",\"\",IF($D218=$M$1,Eingabe!B215,\"\"))","v":""},{"$f":"IF($M$1=\"\",\"\",IF($D218=$M$1,Eingabe!C215,\"\"))","v":""},{"$f":"IF(Eingabe!$A215=$M$1,$M$1,\"\")","v":""},{"$f":"IF($M$1=\"\",\"\",IF($D218=$M$1,Eingabe!G215,\"\"))","v":""}]
[214,{"$f":"IF($M$1=\"\",\"\",IF($D219=$M$1,Eingabe!B216,\"\"))","v":""},{"$f":"IF($M$1=\"\",\"\",IF($D219=$M$1,Eingabe!C216,\"\"))","v":""},{"$f":"IF(Eingabe!$A216=$M$1,$M$1,\"\")","v":""},{"$f":"IF($M$1=\"\",\"\",IF($D219=$M$1,Eingabe!G216,\"\"))","v":""}]
[215,{"$f":"IF($M$1=\"\",\"\",IF($D220=$M$1,Eingabe!B217,\"\"))","v":""},{"$f":"IF($M$1=\"\",\"\",IF($D220=$M$1,Eingabe!C217,\"\"))","v":""},{"$f":"IF(Eingabe!$A217=$M$1,$M$1,\"\")","v":""},{"$f":"IF($M$1=\"\",\"\",IF($D220=$M$1,Eingabe!G217,\"\"))","v":""}]
[216,{"$f":"IF($M$1=\"\",\"\",IF($D221=$M$1,Eingabe!B218,\"\"))","v":""},{"$f":"IF($M$1=\"\",\"\",IF($D221=$M$1,Eingabe!C218,\"\"))","v":""},{"$f":"IF(Eingabe!$A218=$M$1,$M$1,\"\")","v":""},{"$f":"IF($M$1=\"\",\"\",IF($D221=$M$1,Eingabe!G218,\"\"))","v":""}]
[217,{"$f":"IF($M$1=\"\",\"\",IF($D222=$M$1,Eingabe!B219,\"\"))","v":""},{"$f":"IF($M$1=\"\",\"\",IF($D222=$M$1,Eingabe!C219,\"\"))","v":""},{"$f":"IF(Eingabe!$A219=$M$1,$M$1,\"\")","v":""},{"$f":"IF($M$1=\"\",\"\",IF($D222=$M$1,Eingabe!G219,\"\"))","v":""}]
[218,{"$f":"IF($M$1=\"\",\"\",IF($D223=$M$1,Eingabe!B220,\"\"))","v":""},{"$f":"IF($M$1=\"\",\"\",IF($D223=$M$1,Eingabe!C220,\"\"))","v":""},{"$f":"IF(Eingabe!$A220=$M$1,$M$1,\"\")","v":""},{"$f":"IF($M$1=\"\",\"\",IF($D223=$M$1,Eingabe!G220,\"\"))","v":""}]
[219,{"$f":"IF($M$1=\"\",\"\",IF($D224=$M$1,Eingabe!B221,\"\"))","v":""},{"$f":"IF($M$1=\"\",\"\",IF($D224=$M$1,Eingabe!C221,\"\"))","v":""},{"$f":"IF(Eingabe!$A221=$M$1,$M$1,\"\")","v":""},{"$f":"IF($M$1=\"\",\"\",IF($D224=$M$1,Eingabe!G221,\"\"))","v":""}]
[220,{"$f":"IF($M$1=\"\",\"\",IF($D225=$M$1,Eingabe!B222,\"\"))","v":""},{"$f":"IF($M$1=\"\",\"\",IF($D225=$M$1,Eingabe!C222,\"\"))","v":""},{"$f":"IF(Eingabe!$A222=$M$1,$M$1,\"\")","v":""},{"$f":"IF($M$1=\"\",\"\",IF($D225=$M$1,Eingabe!G222,\"\"))","v":""}]
[221,{"$f":"IF($M$1=\"\",\"\",IF($D226=$M$1,Eingabe!B223,\"\"))","v":""},{"$f":"IF($M$1=\"\",\"\",IF($D226=$M$1,Eingabe!C223,\"\"))","v":""},{"$f":"IF(Eingabe!$A223=$M$1,$M$1,\"\")","v":""},{"$f":"IF($M$1=\"\",\"\",IF($D226=$M$1,Eingabe!G223,\"\"))","v":""}]
[222,{"$f":"IF($M$1=\"\",\"\",IF($D227=$M$1,Eingabe!B224,\"\"))","v":""},{"$f":"IF($M$1=\"\",\"\",IF($D227=$M$1,Eingabe!C224,\"\"))","v":""},{"$f":"IF(Eingabe!$A224=$M$1,$M$1,\"\")","v":""},{"$f":"IF($M$1=\"\",\"\",IF($D227=$M$1,Eingabe!G224,\"\"))","v":""}]
[223,{"$f":"IF($M$1=\"\",\"\",IF($D228=$M$1,Eingabe!B225,\"\"))","v":""},{"$f":"IF($M$1=\"\",\"\",IF($D228=$M$1,Eingabe!C225,\"\"))","v":""},{"$f":"IF(Eingabe!$A225=$M$1,$M$1,\"\")","v":""},{"$f":"IF($M$1=\"\",\"\",IF($D228=$M$1,Eingabe!G225,\"\"))","v":""}]
[224,{"$f":"IF($M$1=\"\",\"\",IF($D229=$M$1,Eingabe!B226,\"\"))","v":""},{"$f":"IF($M$1=\"\",\"\",IF($D229=$M$1,Eingabe!C226,\"\"))","v":""},{"$f":"IF(Eingabe!$A226=$M$1,$M$1,\"\")","v":""},{"$f":"IF($M$1=\"\",\"\",IF($D229=$M$1,Eingabe!G226,\"\"))","v":""}]
[225,{"$f":"IF($M$1=\"\",\"\",IF($D230=$M$1,Eingabe!B227,\"\"))","v":""},{"$f":"IF($M$1=\"\",\"\",IF($D230=$M$1,Eingabe!C227,\"\"))","v":""},{"$f":"IF(Eingabe!$A227=$M$1,$M$1,\"\")","v":""},{"$f":"IF($M$1=\"\",\"\",IF($D230=$M$1,Eingabe!G227,\"\"))","v":""}]
[226,{"$f":"IF($M$1=\"\",\"\",IF($D231=$M$1,Eingabe!B228,\"\"))","v":""},{"$f":"IF($M$1=\"\",\"\",IF($D231=$M$1,Eingabe!C228,\"\"))","v":""},{"$f":"IF(Eingabe!$A228=$M$1,$M$1,\"\")","v":""},{"$f":"IF($M$1=\"\",\"\",IF($D231=$M$1,Eingabe!G228,\"\"))","v":""}]
[227,{"$f":"IF($M$1=\"\",\"\",IF($D232=$M$1,Eingabe!B229,\"\"))","v":""},{"$f":"IF($M$1=\"\",\"\",IF($D232=$M$1,Eingabe!C229,\"\"))","v":""},{"$f":"IF(Eingabe!$A229=$M$1,$M$1,\"\")","v":""},{"$f":"IF($M$1=\"\",\"\",IF($D232=$M$1,Eingabe!G229,\"\"))","v":""}]
[228,{"$f":"IF($M$1=\"\",\"\",IF($D233=$M$1,Eingabe!B230,\"\"))","v":""},{"$f":"IF($M$1=\"\",\"\",IF($D233=$M$1,Eingabe!C230,\"\"))","v":""},{"$f":"IF(Eingabe!$A230=$M$1,$M$1,\"\")","v":""},{"$f":"IF($M$1=\"\",\"\",IF($D233=$M$1,Eingabe!G230,\"\"))","v":""}]
[229,{"$f":"IF($M$1=\"\",\"\",IF($D234=$M$1,Eingabe!B231,\"\"))","v":""},{"$f":"IF($M$1=\"\",\"\",IF($D234=$M$1,Eingabe!C231,\"\"))","v":""},{"$f":"IF(Eingabe!$A231=$M$1,$M$1,\"\")","v":""},{"$f":"IF($M$1=\"\",\"\",IF($D234=$M$1,Eingabe!G231,\"\"))","v":""}]
[230,{"$f":"IF($M$1=\"\",\"\",IF($D235=$M$1,Eingabe!B232,\"\"))","v":""},{"$f":"IF($M$1=\"\",\"\",IF($D235=$M$1,Eingabe!C232,\"\"))","v":""},{"$f":"IF(Eingabe!$A232=$M$1,$M$1,\"\")","v":""},{"$f":"IF($M$1=\"\",\"\",IF($D235=$M$1,Eingabe!G232,\"\"))","v":""}]
[231,{"$f":"IF($M$1=\"\",\"\",IF($D236=$M$1,Eingabe!B233,\"\"))","v":""},{"$f":"IF($M$1=\"\",\"\",IF($D236=$M$1,Eingabe!C233,\"\"))","v":""},{"$f":"IF(Eingabe!$A233=$M$1,$M$1,\"\")","v":""},{"$f":"IF($M$1=\"\",\"\",IF($D236=$M$1,Eingabe!G233,\"\"))","v":""}]
[232,{"$f":"IF($M$1=\"\",\"\",IF($D237=$M$1,Eingabe!B234,\"\"))","v":""},{"$f":"IF($M$1=\"\",\"\",IF($D237=$M$1,Eingabe!C234,\"\"))","v":""},{"$f":"IF(Eingabe!$A234=$M$1,$M$1,\"\")","v":""},{"$f":"IF($M$1=\"\",\"\",IF($D237=$M$1,Eingabe!G234,\"\"))","v":""}]
[233,{"$f":"IF($M$1=\"\",\"\",IF($D238=$M$1,Eingabe!B235,\"\"))","v":""},{"$f":"IF($M$1=\"\",\"\",IF($D238=$M$1,Eingabe!C235,\"\"))","v":""},{"$f":"IF(Eingabe!$A235=$M$1,$M$1,\"\")","v":""},{"$f":"IF($M$1=\"\",\"\",IF($D238=$M$1,Eingabe!G235,\"\"))","v":""}]
[234,{"$f":"IF($M$1=\"\",\"\",IF($D239=$M$1,Eingabe!B236,\"\"))","v":""},{"$f":"IF($M$1=\"\",\"\",IF($D239=$M$1,Eingabe!C236,\"\"))","v":""},{"$f":"IF(Eingabe!$A236=$M$1,$M$1,\"\")","v":""},{"$f":"IF($M$1=\"\",\"\",IF($D239=$M$1,Eingabe!G236,\"\"))","v":""}]
[235,{"$f":"IF($M$1=\"\",\"\",IF($D240=$M$1,Eingabe!B237,\"\"))","v":""},{"$f":"IF($M$1=\"\",\"\",IF($D240=$M$1,Eingabe!C237,\"\"))","v":""},{"$f":"IF(Eingabe!$A237=$M$1,$M$1,\"\")","v":""},{"$f":"IF($M$1=\"\",\"\",IF($D240=$M$1,Eingabe!G237,\"\"))","v":""}]
[236,{"$f":"IF($M$1=\"\",\"\",IF($D241=$M$1,Eingabe!B238,\"\"))","v":""},{"$f":"IF($M$1=\"\",\"\",IF($D241=$M$1,Eingabe!C238,\"\"))","v":""},{"$f":"IF(Eingabe!$A238=$M$1,$M$1,\"\")","v":""},{"$f":"IF($M$1=\"\",\"\",IF($D241=$M$1,Eingabe!G238,\"\"))","v":""}]
[237,{"$f":"IF($M$1=\"\",\"\",IF($D242=$M$1,Eingabe!B239,\"\"))","v":""},{"$f":"IF($M$1=\"\",\"\",IF($D242=$M$1,Eingabe!C239,\"\"))","v":""},{"$f":"IF(Eingabe!$A239=$M$1,$M$1,\"\")","v":""},{"$f":"IF($M$1=\"\",\"\",IF($D242=$M$1,Eingabe!G239,\"\"))","v":""}]
[238,{"$f":"IF($M$1=\"\",\"\",IF($D243=$M$1,Eingabe!B240,\"\"))","v":""},{"$f":"IF($M$1=\"\",\"\",IF($D243=$M$1,Eingabe!C240,\"\"))","v":""},{"$f":"IF(Eingabe!$A240=$M$1,$M$1,\"\")","v":""},{"$f":"IF($M$1=\"\",\"\",IF($D243=$M$1,Eingabe!G240,\"\"))","v":""}]
[239,{"$f":"IF($M$1=\"\",\"\",IF($D244=$M$1,Eingabe!B241,\"\"))","v":""},{"$f":"IF($M$1=\"\",\"\",IF($D244=$M$1,Eingabe!C241,\"\"))","v":""},{"$f":"IF(Eingabe!$A241=$M$1,$M$1,\"\")","v":""},{"$f":"IF($M$1=\"\",\"\",IF($D244=$M$1,Eingabe!G241,\"\"))","v":""}]
[240,{"$f":"IF($M$1=\"\",\"\",IF($D245=$M$1,Eingabe!B242,\"\"))","v":""},{"$f":"IF($M$1=\"\",\"\",IF($D245=$M$1,Eingabe!C242,\"\"))","v":""},{"$f":"IF(Eingabe!$A242=$M$1,$M$1,\"\")","v":""},{"$f":"IF($M$1=\"\",\"\",IF($D245=$M$1,Eingabe!G242,\"\"))","v":""}]
[241,{"$f":"IF($M$1=\"\",\"\",IF($D246=$M$1,Eingabe!B243,\"\"))","v":""},{"$f":"IF($M$1=\"\",\"\",IF($D246=$M$1,Eingabe!C243,\"\"))","v":""},{"$f":"IF(Eingabe!$A243=$M$1,$M$1,\"\")","v":""},{"$f":"IF($M$1=\"\",\"\",IF($D246=$M$1,Eingabe!G243,\"\"))","v":""}]
[242,{"$f":"IF($M$1=\"\",\"\",IF($D247=$M$1,Eingabe!B244,\"\"))","v":""},{"$f":"IF($M$1=\"\",\"\",IF($D247=$M$1,Eingabe!C244,\"\"))","v":""},{"$f":"IF(Eingabe!$A244=$M$1,$M$1,\"\")","v":""},{"$f":"IF($M$1=\"\",\"\",IF($D247=$M$1,Eingabe!G244,\"\"))","v":""}]
[243,{"$f":"IF($M$1=\"\",\"\",IF($D248=$M$1,Eingabe!B245,\"\"))","v":""},{"$f":"IF($M$1=\"\",\"\",IF($D248=$M$1,Eingabe!C245,\"\"))","v":""},{"$f":"IF(Eingabe!$A245=$M$1,$M$1,\"\")","v":""},{"$f":"IF($M$1=\"\",\"\",IF($D248=$M$1,Eingabe!G245,\"\"))","v":""}]
[244,{"$f":"IF($M$1=\"\",\"\",IF($D249=$M$1,Eingabe!B246,\"\"))","v":""},{"$f":"IF($M$1=\"\",\"\",IF($D249=$M$1,Eingabe!C246,\"\"))","v":""},{"$f":"IF(Eingabe!$A246=$M$1,$M$1,\"\")","v":""},{"$f":"IF($M$1=\"\",\"\",IF($D249=$M$1,Eingabe!G246,\"\"))","v":""}]
[245,{"$f":"IF($M$1=\"\",\"\",IF($D250=$M$1,Eingabe!B247,\"\"))","v":""},{"$f":"IF($M$1=\"\",\"\",IF($D250=$M$1,Eingabe!C247,\"\"))","v":""},{"$f":"IF(Eingabe!$A247=$M$1,$M$1,\"\")","v":""},{"$f":"IF($M$1=\"\",\"\",IF($D250=$M$1,Eingabe!G247,\"\"))","v":""}]
[246,{"$f":"IF($M$1=\"\",\"\",IF($D251=$M$1,Eingabe!B248,\"\"))","v":""},{"$f":"IF($M$1=\"\",\"\",IF($D251=$M$1,Eingabe!C248,\"\"))","v":""},{"$f":"IF(Eingabe!$A248=$M$1,$M$1,\"\")","v":""},{"$f":"IF($M$1=\"\",\"\",IF($D251=$M$1,Eingabe!G248,\"\"))","v":""}]
[247,{"$f":"IF($M$1=\"\",\"\",IF($D252=$M$1,Eingabe!B249,\"\"))","v":""},{"$f":"IF($M$1=\"\",\"\",IF($D252=$M$1,Eingabe!C249,\"\"))","v":""},{"$f":"IF(Eingabe!$A249=$M$1,$M$1,\"\")","v":""},{"$f":"IF($M$1=\"\",\"\",IF($D252=$M$1,Eingabe!G249,\"\"))","v":""}]
[248,{"$f":"IF($M$1=\"\",\"\",IF($D253=$M$1,Eingabe!B250,\"\"))","v":""},{"$f":"IF($M$1=\"\",\"\",IF($D253=$M$1,Eingabe!C250,\"\"))","v":""},{"$f":"IF(Eingabe!$A250=$M$1,$M$1,\"\")","v":""},{"$f":"IF($M$1=\"\",\"\",IF($D253=$M$1,Eingabe!G250,\"\"))","v":""}]
[249,{"$f":"IF($M$1=\"\",\"\",IF($D254=$M$1,Eingabe!B251,\"\"))","v":""},{"$f":"IF($M$1=\"\",\"\",IF($D254=$M$1,Eingabe!C251,\"\"))","v":""},{"$f":"IF(Eingabe!$A251=$M$1,$M$1,\"\")","v":""},{"$f":"IF($M$1=\"\",\"\",IF($D254=$M$1,Eingabe!G251,\"\"))","v":""}]
[250,{"$f":"IF($M$1=\"\",\"\",IF($D255=$M$1,Eingabe!B252,\"\"))","v":""},{"$f":"IF($M$1=\"\",\"\",IF($D255=$M$1,Eingabe!C252,\"\"))","v":""},{"$f":"IF(Eingabe!$A252=$M$1,$M$1,\"\")","v":""},{"$f":"IF($M$1=\"\",\"\",IF($D255=$M$1,Eingabe!G252,\"\"))","v":""}]
[251,{"$f":"IF($M$1=\"\",\"\",IF($D256=$M$1,Eingabe!B253,\"\"))","v":""},{"$f":"IF($M$1=\"\",\"\",IF($D256=$M$1,Eingabe!C253,\"\"))","v":""},{"$f":"IF(Eingabe!$A253=$M$1,$M$1,\"\")","v":""},{"$f":"IF($M$1=\"\",\"\",IF($D256=$M$1,Eingabe!G253,\"\"))","v":""}]
[252,{"$f":"IF($M$1=\"\",\"\",IF($D257=$M$1,Eingabe!B254,\"\"))","v":""},{"$f":"IF($M$1=\"\",\"\",IF($D257=$M$1,Eingabe!C254,\"\"))","v":""},{"$f":"IF(Eingabe!$A254=$M$1,$M$1,\"\")","v":""},{"$f":"IF($M$1=\"\",\"\",IF($D257=$M$1,Eingabe!G254,\"\"))","v":""}]
[253,{"$f":"IF($M$1=\"\",\"\",IF($D258=$M$1,Eingabe!B255,\"\"))","v":""},{"$f":"IF($M$1=\"\",\"\",IF($D258=$M$1,Eingabe!C255,\"\"))","v":""},{"$f":"IF(Eingabe!$A255=$M$1,$M$1,\"\")","v":""},{"$f":"IF($M$1=\"\",\"\",IF($D258=$M$1,Eingabe!G255,\"\"))","v":""}]
[254,{"$f":"IF($M$1=\"\",\"\",IF($D259=$M$1,Eingabe!B256,\"\"))","v":""},{"$f":"IF($M$1=\"\",\"\",IF($D259=$M$1,Eingabe!C256,\"\"))","v":""},{"$f":"IF(Eingabe!$A256=$M$1,$M$1,\"\")","v":""},{"$f":"IF($M$1=\"\",\"\",IF($D259=$M$1,Eingabe!G256,\"\"))","v":""}]
[255,{"$f":"IF($M$1=\"\",\"\",IF($D260=$M$1,Eingabe!B257,\"\"))","v":""},{"$f":"IF($M$1=\"\",\"\",IF($D260=$M$1,Eingabe!C257,\"\"))","v":""},{"$f":"IF(Eingabe!$A257=$M$1,$M$1,\"\")","v":""},{"$f":"IF($M$1=\"\",\"\",IF($D260=$M$1,Eingabe!G257,\"\"))","v":""}]
[256,{"$f":"IF($M$1=\"\",\"\",IF($D261=$M$1,Eingabe!B258,\"\"))","v":""},{"$f":"IF($M$1=\"\",\"\",IF($D261=$M$1,Eingabe!C258,\"\"))","v":""},{"$f":"IF(Eingabe!$A258=$M$1,$M$1,\"\")","v":""},{"$f":"IF($M$1=\"\",\"\",IF($D261=$M$1,Eingabe!G258,\"\"))","v":""}]
[257,{"$f":"IF($M$1=\"\",\"\",IF($D262=$M$1,Eingabe!B259,\"\"))","v":""},{"$f":"IF($M$1=\"\",\"\",IF($D262=$M$1,Eingabe!C259,\"\"))","v":""},{"$f":"IF(Eingabe!$A259=$M$1,$M$1,\"\")","v":""},{"$f":"IF($M$1=\"\",\"\",IF($D262=$M$1,Eingabe!G259,\"\"))","v":""}]
[258,{"$f":"IF($M$1=\"\",\"\",IF($D263=$M$1,Eingabe!B260,\"\"))","v":""},{"$f":"IF($M$1=\"\",\"\",IF($D263=$M$1,Eingabe!C260,\"\"))","v":""},{"$f":"IF(Eingabe!$A260=$M$1,$M$1,\"\")","v":""},{"$f":"IF($M$1=\"\",\"\",IF($D263=$M$1,Eingabe!G260,\"\"))","v":""}]
[259,{"$f":"IF($M$1=\"\",\"\",IF($D264=$M$1,Eingabe!B261,\"\"))","v":""},{"$f":"IF($M$1=\"\",\"\",IF($D264=$M$1,Eingabe!C261,\"\"))","v":""},{"$f":"IF(Eingabe!$A261=$M$1,$M$1,\"\")","v":""},{"$f":"IF($M$1=\"\",\"\",IF($D264=$M$1,Eingabe!G261,\"\"))","v":""}]
[260,{"$f":"IF($M$1=\"\",\"\",IF($D265=$M$1,Eingabe!B262,\"\"))","v":""},{"$f":"IF($M$1=\"\",\"\",IF($D265=$M$1,Eingabe!C262,\"\"))","v":""},{"$f":"IF(Eingabe!$A262=$M$1,$M$1,\"\")","v":""},{"$f":"IF($M$1=\"\",\"\",IF($D265=$M$1,Eingabe!G262,\"\"))","v":""}]
[261,{"$f":"IF($M$1=\"\",\"\",IF($D266=$M$1,Eingabe!B263,\"\"))","v":""},{"$f":"IF($M$1=\"\",\"\",IF($D266=$M$1,Eingabe!C263,\"\"))","v":""},{"$f":"IF(Eingabe!$A263=$M$1,$M$1,\"\")","v":""},{"$f":"IF($M$1=\"\",\"\",IF($D266=$M$1,Eingabe!G263,\"\"))","v":""}]
[262,{"$f":"IF($M$1=\"\",\"\",IF($D267=$M$1,Eingabe!B264,\"\"))","v":""},{"$f":"IF($M$1=\"\",\"\",IF($D267=$M$1,Eingabe!C264,\"\"))","v":""},{"$f":"IF(Eingabe!$A264=$M$1,$M$1,\"\")","v":""},{"$f":"IF($M$1=\"\",\"\",IF($D267=$M$1,Eingabe!G264,\"\"))","v":""}]
[263,{"$f":"IF($M$1=\"\",\"\",IF($D268=$M$1,Eingabe!B265,\"\"))","v":""},{"$f":"IF($M$1=\"\",\"\",IF($D268=$M$1,Eingabe!C265,\"\"))","v":""},{"$f":"IF(Eingabe!$A265=$M$1,$M$1,\"\")","v":""},{"$f":"IF($M$1=\"\",\"\",IF($D268=$M$1,Eingabe!G265,\"\"))","v":""}]
[264,{"$f":"IF($M$1=\"\",\"\",IF($D269=$M$1,Eingabe!B266,\"\"))","v":""},{"$f":"IF($M$1=\"\",\"\",IF($D269=$M$1,Eingabe!C266,\"\"))","v":""},{"$f":"IF(Eingabe!$A266=$M$1,$M$1,\"\")","v":""},{"$f":"IF($M$1=\"\",\"\",IF($D269=$M$1,Eingabe!G266,\"\"))","v":""}]
[265,{"$f":"IF($M$1=\"\",\"\",IF($D270=$M$1,Eingabe!B267,\"\"))","v":""},{"$f":"IF($M$1=\"\",\"\",IF($D270=$M$1,Eingabe!C267,\"\"))","v":""},{"$f":"IF(Eingabe!$A267=$M$1,$M$1,\"\")","v":""},{"$f":"IF($M$1=\"\",\"\",IF($D270=$M$1,Eingabe!G267,\"\"))","v":""}]
[266,{"$f":"IF($M$1=\"\",\"\",IF($D271=$M$1,Eingabe!B268,\"\"))","v":""},{"$f":"IF($M$1=\"\",\"\",IF($D271=$M$1,Eingabe!C268,\"\"))","v":""},{"$f":"IF(Eingabe!$A268=$M$1,$M$1,\"\")","v":""},{"$f":"IF($M$1=\"\",\"\",IF($D271=$M$1,Eingabe!G268,\"\"))","v":""}]
[267,{"$f":"IF($M$1=\"\",\"\",IF($D272=$M$1,Eingabe!B269,\"\"))","v":""},{"$f":"IF($M$1=\"\",\"\",IF($D272=$M$1,Eingabe!C269,\"\"))","v":""},{"$f":"IF(Eingabe!$A269=$M$1,$M$1,\"\")","v":""},{"$f":"IF($M$1=\"\",\"\",IF($D272=$M$1,Eingabe!G269,\"\"))","v":""}]
[268,{"$f":"IF($M$1=\"\",\"\",IF($D273=$M$1,Eingabe!B270,\"\"))","v":""},{"$f":"IF($M$1=\"\",\"\",IF($D273=$M$1,Eingabe!C270,\"\"))","v":""},{"$f":"IF(Eingabe!$A270=$M$1,$M$1,\"\")","v":""},{"$f":"IF($M$1=\"\",\"\",IF($D273=$M$1,Eingabe!G270,\"\"))","v":""}]
[269,{"$f":"IF($M$1=\"\",\"\",IF($D274=$M$1,Eingabe!B271,\"\"))","v":""},{"$f":"IF($M$1=\"\",\"\",IF($D274=$M$1,Eingabe!C271,\"\"))","v":""},{"$f":"IF(Eingabe!$A271=$M$1,$M$1,\"\")","v":""},{"$f":"IF($M$1=\"\",\"\",IF($D274=$M$1,Eingabe!G271,\"\"))","v":""}]
[270,{"$f":"IF($M$1=\"\",\"\",IF($D275=$M$1,Eingabe!B272,\"\"))","v":""},{"$f":"IF($M$1=\"\",\"\",IF($D275=$M$1,Eingabe!C272,\"\"))","v":""},{"$f":"IF(Eingabe!$A272=$M$1,$M$1,\"\")","v":""},{"$f":"IF($M$1=\"\",\"\",IF($D275=$M$1,Eingabe!G272,\"\"))","v":""}]
[271,{"$f":"IF($M$1=\"\",\"\",IF($D276=$M$1,Eingabe!B273,\"\"))","v":""},{"$f":"IF($M$1=\"\",\"\",IF($D276=$M$1,Eingabe!C273,\"\"))","v":""},{"$f":"IF(Eingabe!$A273=$M$1,$M$1,\"\")","v":""},{"$f":"IF($M$1=\"\",\"\",IF($D276=$M$1,Eingabe!G273,\"\"))","v":""}]
[272,{"$f":"IF($M$1=\"\",\"\",IF($D277=$M$1,Eingabe!B274,\"\"))","v":""},{"$f":"IF($M$1=\"\",\"\",IF($D277=$M$1,Eingabe!C274,\"\"))","v":""},{"$f":"IF(Eingabe!$A274=$M$1,$M$1,\"\")","v":""},{"$f":"IF($M$1=\"\",\"\",IF($D277=$M$1,Eingabe!G274,\"\"))","v":""}]
[273,{"$f":"IF($M$1=\"\",\"\",IF($D278=$M$1,Eingabe!B275,\"\"))","v":""},{"$f":"IF($M$1=\"\",\"\",IF($D278=$M$1,Eingabe!C275,\"\"))","v":""},{"$f":"IF(Eingabe!$A275=$M$1,$M$1,\"\")","v":""},{"$f":"IF($M$1=\"\",\"\",IF($D278=$M$1,Eingabe!G275,\"\"))","v":""}]
[274,{"$f":"IF($M$1=\"\",\"\",IF($D279=$M$1,Eingabe!B276,\"\"))","v":""},{"$f":"IF($M$1=\"\",\"\",IF($D279=$M$1,Eingabe!C276,\"\"))","v":""},{"$f":"IF(Eingabe!$A276=$M$1,$M$1,\"\")","v":""},{"$f":"IF($M$1=\"\",\"\",IF($D279=$M$1,Eingabe!G276,\"\"))","v":""}]
[275,{"$f":"IF($M$1=\"\",\"\",IF($D280=$M$1,Eingabe!B277,\"\"))","v":""},{"$f":"IF($M$1=\"\",\"\",IF($D280=$M$1,Eingabe!C277,\"\"))","v":""},{"$f":"IF(Eingabe!$A277=$M$1,$M$1,\"\")","v":""},{"$f":"IF($M$1=\"\",\"\",IF($D280=$M$1,Eingabe!G277,\"\"))","v":""}]
[276,{"$f":"IF($M$1=\"\",\"\",IF($D281=$M$1,Eingabe!B278,\"\"))","v":""},{"$f":"IF($M$1=\"\",\"\",IF($D281=$M$1,Eingabe!C278,\"\"))","v":""},{"$f":"IF(Eingabe!$A278=$M$1,$M$1,\"\")","v":""},{"$f":"IF($M$1=\"\",\"\",IF($D281=$M$1,Eingabe!G278,\"\"))","v":""}]
[277,{"$f":"IF($M$1=\"\",\"\",IF($D282=$M$1,Eingabe!B279,\"\"))","v":""},{"$f":"IF($M$1=\"\",\"\",IF($D282=$M$1,Eingabe!C279,\"\"))","v":""},{"$f":"IF(Eingabe!$A279=$M$1,$M$1,\"\")","v":""},{"$f":"IF($M$1=\"\",\"\",IF($D282=$M$1,Eingabe!G279,\"\"))","v":""}]
[278,{"$f":"IF($M$1=\"\",\"\",IF($D283=$M$1,Eingabe!B280,\"\"))","v":""},{"$f":"IF($M$1=\"\",\"\",IF($D283=$M$1,Eingabe!C280,\"\"))","v":""},{"$f":"IF(Eingabe!$A280=$M$1,$M$1,\"\")","v":""},{"$f":"IF($M$1=\"\",\"\",IF($D283=$M$1,Eingabe!G280,\"\"))","v":""}]
[279,{"$f":"IF($M$1=\"\",\"\",IF($D284=$M$1,Eingabe!B281,\"\"))","v":""},{"$f":"IF($M$1=\"\",\"\",IF($D284=$M$1,Eingabe!C281,\"\"))","v":""},{"$f":"IF(Eingabe!$A281=$M$1,$M$1,\"\")","v":""},{"$f":"IF($M$1=\"\",\"\",IF($D284=$M$1,Eingabe!G281,\"\"))","v":""}]
[280,{"$f":"IF($M$1=\"\",\"\",IF($D285=$M$1,Eingabe!B282,\"\"))","v":""},{"$f":"IF($M$1=\"\",\"\",IF($D285=$M$1,Eingabe!C282,\"\"))","v":""},{"$f":"IF(Eingabe!$A282=$M$1,$M$1,\"\")","v":""},{"$f":"IF($M$1=\"\",\"\",IF($D285=$M$1,Eingabe!G282,\"\"))","v":""}]
[281,{"$f":"IF($M$1=\"\",\"\",IF($D286=$M$1,Eingabe!B283,\"\"))","v":""},{"$f":"IF($M$1=\"\",\"\",IF($D286=$M$1,Eingabe!C283,\"\"))","v":""},{"$f":"IF(Eingabe!$A283=$M$1,$M$1,\"\")","v":""},{"$f":"IF($M$1=\"\",\"\",IF($D286=$M$1,Eingabe!G283,\"\"))","v":""}]
[282,{"$f":"IF($M$1=\"\",\"\",IF($D287=$M$1,Eingabe!B284,\"\"))","v":""},{"$f":"IF($M$1=\"\",\"\",IF($D287=$M$1,Eingabe!C284,\"\"))","v":""},{"$f":"IF(Eingabe!$A284=$M$1,$M$1,\"\")","v":""},{"$f":"IF($M$1=\"\",\"\",IF($D287=$M$1,Eingabe!G284,\"\"))","v":""}]
[283,{"$f":"IF($M$1=\"\",\"\",IF($D288=$M$1,Eingabe!B285,\"\"))","v":""},{"$f":"IF($M$1=\"\",\"\",IF($D288=$M$1,Eingabe!C285,\"\"))","v":""},{"$f":"IF(Eingabe!$A285=$M$1,$M$1,\"\")","v":""},{"$f":"IF($M$1=\"\",\"\",IF($D288=$M$1,Eingabe!G285,\"\"))","v":""}]
[284,{"$f":"IF($M$1=\"\",\"\",IF($D289=$M$1,Eingabe!B286,\"\"))","v":""},{"$f":"IF($M$1=\"\",\"\",IF($D289=$M$1,Eingabe!C286,\"\"))","v":""},{"$f":"IF(Eingabe!$A286=$M$1,$M$1,\"\")","v":""},{"$f":"IF($M$1=\"\",\"\",IF($D289=$M$1,Eingabe!G286,\"\"))","v":""}]
[285,{"$f":"IF($M$1=\"\",\"\",IF($D290=$M$1,Eingabe!B287,\"\"))","v":""},{"$f":"IF($M$1=\"\",\"\",IF($D290=$M$1,Eingabe!C287,\"\"))","v":""},{"$f":"IF(Eingabe!$A287=$M$1,$M$1,\"\")","v":""},{"$f":"IF($M$1=\"\",\"\",IF($D290=$M$1,Eingabe!G287,\"\"))","v":""}]
[286,{"$f":"IF($M$1=\"\",\"\",IF($D291=$M$1,Eingabe!B288,\"\"))","v":""},{"$f":"IF($M$1=\"\",\"\",IF($D291=$M$1,Eingabe!C288,\"\"))","v":""},{"$f":"IF(Eingabe!$A288=$M$1,$M$1,\"\")","v":""},{"$f":"IF($M$1=\"\",\"\",IF($D291=$M$1,Eingabe!G288,\"\"))","v":""}]
[287,{"$f":"IF($M$1=\"\",\"\",IF($D292=$M$1,Eingabe!B289,\"\"))","v":""},{"$f":"IF($M$1=\"\",\"\",IF($D292=$M$1,Eingabe!C289,\"\"))","v":""},{"$f":"IF(Eingabe!$A289=$M$1,$M$1,\"\")","v":""},{"$f":"IF($M$1=\"\",\"\",IF($D292=$M$1,Eingabe!G289,\"\"))","v":""}]
[288,{"$f":"IF($M$1=\"\",\"\",IF($D293=$M$1,Eingabe!B290,\"\"))","v":""},{"$f":"IF($M$1=\"\",\"\",IF($D293=$M$1,Eingabe!C290,\"\"))","v":""},{"$f":"IF(Eingabe!$A290=$M$1,$M$1,\"\")","v":""},{"$f":"IF($M$1=\"\",\"\",IF($D293=$M$1,Eingabe!G290,\"\"))","v":""}]
[289,{"$f":"IF($M$1=\"\",\"\",IF($D294=$M$1,Eingabe!B291,\"\"))","v":""},{"$f":"IF($M$1=\"\",\"\",IF($D294=$M$1,Eingabe!C291,\"\"))","v":""},{"$f":"IF(Eingabe!$A291=$M$1,$M$1,\"\")","v":""},{"$f":"IF($M$1=\"\",\"\",IF($D294=$M$1,Eingabe!G291,\"\"))","v":""}]
[290,{"$f":"IF($M$1=\"\",\"\",IF($D295=$M$1,Eingabe!B292,\"\"))","v":""},{"$f":"IF($M$1=\"\",\"\",IF($D295=$M$1,Eingabe!C292,\"\"))","v":""},{"$f":"IF(Eingabe!$A292=$M$1,$M$1,\"\")","v":""},{"$f":"IF($M$1=\"\",\"\",IF($D295=$M$1,Eingabe!G292,\"\"))","v":""}]
[291,{"$f":"IF($M$1=\"\",\"\",IF($D296=$M$1,Eingabe!B293,\"\"))","v":""},{"$f":"IF($M$1=\"\",\"\",IF($D296=$M$1,Eingabe!C293,\"\"))","v":""},{"$f":"IF(Eingabe!$A293=$M$1,$M$1,\"\")","v":""},{"$f":"IF($M$1=\"\",\"\",IF($D296=$M$1,Eingabe!G293,\"\"))","v":""}]
[292,{"$f":"IF($M$1=\"\",\"\",IF($D297=$M$1,Eingabe!B294,\"\"))","v":""},{"$f":"IF($M$1=\"\",\"\",IF($D297=$M$1,Eingabe!C294,\"\"))","v":""},{"$f":"IF(Eingabe!$A294=$M$1,$M$1,\"\")","v":""},{"$f":"IF($M$1=\"\",\"\",IF($D297=$M$1,Eingabe!G294,\"\"))","v":""}]
[293,{"$f":"IF($M$1=\"\",\"\",IF($D298=$M$1,Eingabe!B295,\"\"))","v":""},{"$f":"IF($M$1=\"\",\"\",IF($D298=$M$1,Eingabe!C295,\"\"))","v":""},{"$f":"IF(Eingabe!$A295=$M$1,$M$1,\"\")","v":""},{"$f":"IF($M$1=\"\",\"\",IF($D298=$M$1,Eingabe!G295,\"\"))","v":""}]
[294,{"$f":"IF($M$1=\"\",\"\",IF($D299=$M$1,Eingabe!B296,\"\"))","v":""},{"$f":"IF($M$1=\"\",\"\",IF($D299=$M$1,Eingabe!C296,\"\"))","v":""},{"$f":"IF(Eingabe!$A296=$M$1,$M$1,\"\")","v":""},{"$f":"IF($M$1=\"\",\"\",IF($D299=$M$1,Eingabe!G296,\"\"))","v":""}]
[295,{"$f":"IF($M$1=\"\",\"\",IF($D300=$M$1,Eingabe!B297,\"\"))","v":""},{"$f":"IF($M$1=\"\",\"\",IF($D300=$M$1,Eingabe!C297,\"\"))","v":""},{"$f":"IF(Eingabe!$A297=$M$1,$M$1,\"\")","v":""},{"$f":"IF($M$1=\"\",\"\",IF($D300=$M$1,Eingabe!G297,\"\"))","v":""}]
[296,{"$f":"IF($M$1=\"\",\"\",IF($D301=$M$1,Eingabe!B298,\"\"))","v":""},{"$f":"IF($M$1=\"\",\"\",IF($D301=$M$1,Eingabe!C298,\"\"))","v":""},{"$f":"IF(Eingabe!$A298=$M$1,$M$1,\"\")","v":""},{"$f":"IF($M$1=\"\",\"\",IF($D301=$M$1,Eingabe!G298,\"\"))","v":""}]
[297,{"$f":"IF($M$1=\"\",\"\",IF($D302=$M$1,Eingabe!B299,\"\"))","v":""},{"$f":"IF($M$1=\"\",\"\",IF($D302=$M$1,Eingabe!C299,\"\"))","v":""},{"$f":"IF(Eingabe!$A299=$M$1,$M$1,\"\")","v":""},{"$f":"IF($M$1=\"\",\"\",IF($D302=$M$1,Eingabe!G299,\"\"))","v":""}]
[298,{"$f":"IF($M$1=\"\",\"\",IF($D303=$M$1,Eingabe!B300,\"\"))","v":""},{"$f":"IF($M$1=\"\",\"\",IF($D303=$M$1,Eingabe!C300,\"\"))","v":""},{"$f":"IF(Eingabe!$A300=$M$1,$M$1,\"\")","v":""},{"$f":"IF($M$1=\"\",\"\",IF($D303=$M$1,Eingabe!G300,\"\"))","v":""}]
[299,{"$f":"IF($M$1=\"\",\"\",IF($D304=$M$1,Eingabe!B301,\"\"))","v":""},{"$f":"IF($M$1=\"\",\"\",IF($D304=$M$1,Eingabe!C301,\"\"))","v":""},{"$f":"IF(Eingabe!$A301=$M$1,$M$1,\"\")","v":""},{"$f":"IF($M$1=\"\",\"\",IF($D304=$M$1,Eingabe!G301,\"\"))","v":""}]
[300,{"$f":"IF($M$1=\"\",\"\",IF($D305=$M$1,Eingabe!B302,\"\"))","v":""},{"$f":"IF($M$1=\"\",\"\",IF($D305=$M$1,Eingabe!C302,\"\"))","v":""},{"$f":"IF(Eingabe!$A302=$M$1,$M$1,\"\")","v":""},{"$f":"IF($M$1=\"\",\"\",IF($D305=$M$1,Eingabe!G302,\"\"))","v":""}]
[301,{"$f":"IF($M$1=\"\",\"\",IF($D306=$M$1,Eingabe!B303,\"\"))","v":""},{"$f":"IF($M$1=\"\",\"\",IF($D306=$M$1,Eingabe!C303,\"\"))","v":""},{"$f":"IF(Eingabe!$A303=$M$1,$M$1,\"\")","v":""},{"$f":"IF($M$1=\"\",\"\",IF($D306=$M$1,Eingabe!G303,\"\"))","v":""}]
[302,{"$f":"IF($M$1=\"\",\"\",IF($D307=$M$1,Eingabe!B304,\"\"))","v":""},{"$f":"IF($M$1=\"\",\"\",IF($D307=$M$1,Eingabe!C304,\"\"))","v":""},{"$f":"IF(Eingabe!$A304=$M$1,$M$1,\"\")","v":""},{"$f":"IF($M$1=\"\",\"\",IF($D307=$M$1,Eingabe!G304,\"\"))","v":""}]
[303,{"$f":"IF($M$1=\"\",\"\",IF($D308=$M$1,Eingabe!B305,\"\"))","v":""},{"$f":"IF($M$1=\"\",\"\",IF($D308=$M$1,Eingabe!C305,\"\"))","v":""},{"$f":"IF(Eingabe!$A305=$M$1,$M$1,\"\")","v":""},{"$f":"IF($M$1=\"\",\"\",IF($D308=$M$1,Eingabe!G305,\"\"))","v":""}]
[304,{"$f":"IF($M$1=\"\",\"\",IF($D309=$M$1,Eingabe!B306,\"\"))","v":""},{"$f":"IF($M$1=\"\",\"\",IF($D309=$M$1,Eingabe!C306,\"\"))","v":""},{"$f":"IF(Eingabe!$A306=$M$1,$M$1,\"\")","v":""},{"$f":"IF($M$1=\"\",\"\",IF($D309=$M$1,Eingabe!G306,\"\"))","v":""}]
[305,{"$f":"IF($M$1=\"\",\"\",IF($D310=$M$1,Eingabe!B307,\"\"))","v":""},{"$f":"IF($M$1=\"\",\"\",IF($D310=$M$1,Eingabe!C307,\"\"))","v":""},{"$f":"IF(Eingabe!$A307=$M$1,$M$1,\"\")","v":""},{"$f":"IF($M$1=\"\",\"\",IF($D310=$M$1,Eingabe!G307,\"\"))","v":""}]
[306,{"$f":"IF($M$1=\"\",\"\",IF($D311=$M$1,Eingabe!B308,\"\"))","v":""},{"$f":"IF($M$1=\"\",\"\",IF($D311=$M$1,Eingabe!C308,\"\"))","v":""},{"$f":"IF(Eingabe!$A308=$M$1,$M$1,\"\")","v":""},{"$f":"IF($M$1=\"\",\"\",IF($D311=$M$1,Eingabe!G308,\"\"))","v":""}]
[307,{"$f":"IF($M$1=\"\",\"\",IF($D312=$M$1,Eingabe!B309,\"\"))","v":""},{"$f":"IF($M$1=\"\",\"\",IF($D312=$M$1,Eingabe!C309,\"\"))","v":""},{"$f":"IF(Eingabe!$A309=$M$1,$M$1,\"\")","v":""},{"$f":"IF($M$1=\"\",\"\",IF($D312=$M$1,Eingabe!G309,\"\"))","v":""}]
[308,{"$f":"IF($M$1=\"\",\"\",IF($D313=$M$1,Eingabe!B310,\"\"))","v":""},{"$f":"IF($M$1=\"\",\"\",IF($D313=$M$1,Eingabe!C310,\"\"))","v":""},{"$f":"IF(Eingabe!$A310=$M$1,$M$1,\"\")","v":""},{"$f":"IF($M$1=\"\",\"\",IF($D313=$M$1,Eingabe!G310,\"\"))","v":""}]
[309,{"$f":"IF($M$1=\"\",\"\",IF($D314=$M$1,Eingabe!B311,\"\"))","v":""},{"$f":"IF($M$1=\"\",\"\",IF($D314=$M$1,Eingabe!C311,\"\"))","v":""},{"$f":"IF(Eingabe!$A311=$M$1,$M$1,\"\")","v":""},{"$f":"IF($M$1=\"\",\"\",IF($D314=$M$1,Eingabe!G311,\"\"))","v":""}]
[310,{"$f":"IF($M$1=\"\",\"\",IF($D315=$M$1,Eingabe!B312,\"\"))","v":""},{"$f":"IF($M$1=\"\",\"\",IF($D315=$M$1,Eingabe!C312,\"\"))","v":""},{"$f":"IF(Eingabe!$A312=$M$1,$M$1,\"\")","v":""},{"$f":"IF($M$1=\"\",\"\",IF($D315=$M$1,Eingabe!G312,\"\"))","v":""}]
[311,{"$f":"IF($M$1=\"\",\"\",IF($D316=$M$1,Eingabe!B313,\"\"))","v":""},{"$f":"IF($M$1=\"\",\"\",IF($D316=$M$1,Eingabe!C313,\"\"))","v":""},{"$f":"IF(Eingabe!$A313=$M$1,$M$1,\"\")","v":""},{"$f":"IF($M$1=\"\",\"\",IF($D316=$M$1,Eingabe!G313,\"\"))","v":""}]
[312,{"$f":"IF($M$1=\"\",\"\",IF($D317=$M$1,Eingabe!B314,\"\"))","v":""},{"$f":"IF($M$1=\"\",\"\",IF($D317=$M$1,Eingabe!C314,\"\"))","v":""},{"$f":"IF(Eingabe!$A314=$M$1,$M$1,\"\")","v":""},{"$f":"IF($M$1=\"\",\"\",IF($D317=$M$1,Eingabe!G314,\"\"))","v":""}]
[313,{"$f":"IF($M$1=\"\",\"\",IF($D318=$M$1,Eingabe!B315,\"\"))","v":""},{"$f":"IF($M$1=\"\",\"\",IF($D318=$M$1,Eingabe!C315,\"\"))","v":""},{"$f":"IF(Eingabe!$A315=$M$1,$M$1,\"\")","v":""},{"$f":"IF($M$1=\"\",\"\",IF($D318=$M$1,Eingabe!G315,\"\"))","v":""}]
[314,{"$f":"IF($M$1=\"\",\"\",IF($D319=$M$1,Eingabe!B316,\"\"))","v":""},{"$f":"IF($M$1=\"\",\"\",IF($D319=$M$1,Eingabe!C316,\"\"))","v":""},{"$f":"IF(Eingabe!$A316=$M$1,$M$1,\"\")","v":""},{"$f":"IF($M$1=\"\",\"\",IF($D319=$M$1,Eingabe!G316,\"\"))","v":""}]
[315,{"$f":"IF($M$1=\"\",\"\",IF($D320=$M$1,Eingabe!B317,\"\"))","v":""},{"$f":"IF($M$1=\"\",\"\",IF($D320=$M$1,Eingabe!C317,\"\"))","v":""},{"$f":"IF(Eingabe!$A317=$M$1,$M$1,\"\")","v":""},{"$f":"IF($M$1=\"\",\"\",IF($D320=$M$1,Eingabe!G317,\"\"))","v":""}]
[316,{"$f":"IF($M$1=\"\",\"\",IF($D321=$M$1,Eingabe!B318,\"\"))","v":""},{"$f":"IF($M$1=\"\",\"\",IF($D321=$M$1,Eingabe!C318,\"\"))","v":""},{"$f":"IF(Eingabe!$A318=$M$1,$M$1,\"\")","v":""},{"$f":"IF($M$1=\"\",\"\",IF($D321=$M$1,Eingabe!G318,\"\"))","v":""}]
[317,{"$f":"IF($M$1=\"\",\"\",IF($D322=$M$1,Eingabe!B319,\"\"))","v":""},{"$f":"IF($M$1=\"\",\"\",IF($D322=$M$1,Eingabe!C319,\"\"))","v":""},{"$f":"IF(Eingabe!$A319=$M$1,$M$1,\"\")","v":""},{"$f":"IF($M$1=\"\",\"\",IF($D322=$M$1,Eingabe!G319,\"\"))","v":""}]
[318,{"$f":"IF($M$1=\"\",\"\",IF($D323=$M$1,Eingabe!B320,\"\"))","v":""},{"$f":"IF($M$1=\"\",\"\",IF($D323=$M$1,Eingabe!C320,\"\"))","v":""},{"$f":"IF(Eingabe!$A320=$M$1,$M$1,\"\")","v":""},{"$f":"IF($M$1=\"\",\"\",IF($D323=$M$1,Eingabe!G320,\"\"))","v":""}]
[319,{"$f":"IF($M$1=\"\",\"\",IF($D324=$M$1,Eingabe!B321,\"\"))","v":""},{"$f":"IF($M$1=\"\",\"\",IF($D324=$M$1,Eingabe!C321,\"\"))","v":""},{"$f":"IF(Eingabe!$A321=$M$1,$M$1,\"\")","v":""},{"$f":"IF($M$1=\"\",\"\",IF($D324=$M$1,Eingabe!G321,\"\"))","v":""}]
[320,{"$f":"IF($M$1=\"\",\"\",IF($D325=$M$1,Eingabe!B322,\"\"))","v":""},{"$f":"IF($M$1=\"\",\"\",IF($D325=$M$1,Eingabe!C322,\"\"))","v":""},{"$f":"IF(Eingabe!$A322=$M$1,$M$1,\"\")","v":""},{"$f":"IF($M$1=\"\",\"\",IF($D325=$M$1,Eingabe!G322,\"\"))","v":""}]
[321,{"$f":"IF($M$1=\"\",\"\",IF($D326=$M$1,Eingabe!B323,\"\"))","v":""},{"$f":"IF($M$1=\"\",\"\",IF($D326=$M$1,Eingabe!C323,\"\"))","v":""},{"$f":"IF(Eingabe!$A323=$M$1,$M$1,\"\")","v":""},{"$f":"IF($M$1=\"\",\"\",IF($D326=$M$1,Eingabe!G323,\"\"))","v":""}]
[322,{"$f":"IF($M$1=\"\",\"\",IF($D327=$M$1,Eingabe!B324,\"\"))","v":""},{"$f":"IF($M$1=\"\",\"\",IF($D327=$M$1,Eingabe!C324,\"\"))","v":""},{"$f":"IF(Eingabe!$A324=$M$1,$M$1,\"\")","v":""},{"$f":"IF($M$1=\"\",\"\",IF($D327=$M$1,Eingabe!G324,\"\"))","v":""}]
[323,{"$f":"IF($M$1=\"\",\"\",IF($D328=$M$1,Eingabe!B325,\"\"))","v":""},{"$f":"IF($M$1=\"\",\"\",IF($D328=$M$1,Eingabe!C325,\"\"))","v":""},{"$f":"IF(Eingabe!$A325=$M$1,$M$1,\"\")","v":""},{"$f":"IF($M$1=\"\",\"\",IF($D328=$M$1,Eingabe!G325,\"\"))","v":""}]
[324,{"$f":"IF($M$1=\"\",\"\",IF($D329=$M$1,Eingabe!B326,\"\"))","v":""},{"$f":"IF($M$1=\"\",\"\",IF($D329=$M$1,Eingabe!C326,\"\"))","v":""},{"$f":"IF(Eingabe!$A326=$M$1,$M$1,\"\")","v":""},{"$f":"IF($M$1=\"\",\"\",IF($D329=$M$1,Eingabe!G326,\"\"))","v":""}]
[325,{"$f":"IF($M$1=\"\",\"\",IF($D330=$M$1,Eingabe!B327,\"\"))","v":""},{"$f":"IF($M$1=\"\",\"\",IF($D330=$M$1,Eingabe!C327,\"\"))","v":""},{"$f":"IF(Eingabe!$A327=$M$1,$M$1,\"\")","v":""},{"$f":"IF($M$1=\"\",\"\",IF($D330=$M$1,Eingabe!G327,\"\"))","v":""}]
[326,{"$f":"IF($M$1=\"\",\"\",IF($D331=$M$1,Eingabe!B328,\"\"))","v":""},{"$f":"IF($M$1=\"\",\"\",IF($D331=$M$1,Eingabe!C328,\"\"))","v":""},{"$f":"IF(Eingabe!$A328=$M$1,$M$1,\"\")","v":""},{"$f":"IF($M$1=\"\",\"\",IF($D331=$M$1,Eingabe!G328,\"\"))","v":""}]
[327,{"$f":"IF($M$1=\"\",\"\",IF($D332=$M$1,Eingabe!B329,\"\"))","v":""},{"$f":"IF($M$1=\"\",\"\",IF($D332=$M$1,Eingabe!C329,\"\"))","v":""},{"$f":"IF(Eingabe!$A329=$M$1,$M$1,\"\")","v":""},{"$f":"IF($M$1=\"\",\"\",IF($D332=$M$1,Eingabe!G329,\"\"))","v":""}]
[328,{"$f":"IF($M$1=\"\",\"\",IF($D333=$M$1,Eingabe!B330,\"\"))","v":""},{"$f":"IF($M$1=\"\",\"\",IF($D333=$M$1,Eingabe!C330,\"\"))","v":""},{"$f":"IF(Eingabe!$A330=$M$1,$M$1,\"\")","v":""},{"$f":"IF($M$1=\"\",\"\",IF($D333=$M$1,Eingabe!G330,\"\"))","v":""}]
[329,{"$f":"IF($M$1=\"\",\"\",IF($D334=$M$1,Eingabe!B331,\"\"))","v":""},{"$f":"IF($M$1=\"\",\"\",IF($D334=$M$1,Eingabe!C331,\"\"))","v":""},{"$f":"IF(Eingabe!$A331=$M$1,$M$1,\"\")","v":""},{"$f":"IF($M$1=\"\",\"\",IF($D334=$M$1,Eingabe!G331,\"\"))","v":""}]
[330,{"$f":"IF($M$1=\"\",\"\",IF($D335=$M$1,Eingabe!B332,\"\"))","v":""},{"$f":"IF($M$1=\"\",\"\",IF($D335=$M$1,Eingabe!C332,\"\"))","v":""},{"$f":"IF(Eingabe!$A332=$M$1,$M$1,\"\")","v":""},{"$f":"IF($M$1=\"\",\"\",IF($D335=$M$1,Eingabe!G332,\"\"))","v":""}]
[331,{"$f":"IF($M$1=\"\",\"\",IF($D336=$M$1,Eingabe!B333,\"\"))","v":""},{"$f":"IF($M$1=\"\",\"\",IF($D336=$M$1,Eingabe!C333,\"\"))","v":""},{"$f":"IF(Eingabe!$A333=$M$1,$M$1,\"\")","v":""},{"$f":"IF($M$1=\"\",\"\",IF($D336=$M$1,Eingabe!G333,\"\"))","v":""}]
[332,{"$f":"IF($M$1=\"\",\"\",IF($D337=$M$1,Eingabe!B334,\"\"))","v":""},{"$f":"IF($M$1=\"\",\"\",IF($D337=$M$1,Eingabe!C334,\"\"))","v":""},{"$f":"IF(Eingabe!$A334=$M$1,$M$1,\"\")","v":""},{"$f":"IF($M$1=\"\",\"\",IF($D337=$M$1,Eingabe!G334,\"\"))","v":""}]
[333,{"$f":"IF($M$1=\"\",\"\",IF($D338=$M$1,Eingabe!B335,\"\"))","v":""},{"$f":"IF($M$1=\"\",\"\",IF($D338=$M$1,Eingabe!C335,\"\"))","v":""},{"$f":"IF(Eingabe!$A335=$M$1,$M$1,\"\")","v":""},{"$f":"IF($M$1=\"\",\"\",IF($D338=$M$1,Eingabe!G335,\"\"))","v":""}]
[334,{"$f":"IF($M$1=\"\",\"\",IF($D339=$M$1,Eingabe!B336,\"\"))","v":""},{"$f":"IF($M$1=\"\",\"\",IF($D339=$M$1,Eingabe!C336,\"\"))","v":""},{"$f":"IF(Eingabe!$A336=$M$1,$M$1,\"\")","v":""},{"$f":"IF($M$1=\"\",\"\",IF($D339=$M$1,Eingabe!G336,\"\"))","v":""}]
[335,{"$f":"IF($M$1=\"\",\"\",IF($D340=$M$1,Eingabe!B337,\"\"))","v":""},{"$f":"IF($M$1=\"\",\"\",IF($D340=$M$1,Eingabe!C337,\"\"))","v":""},{"$f":"IF(Eingabe!$A337=$M$1,$M$1,\"\")","v":""},{"$f":"IF($M$1=\"\",\"\",IF($D340=$M$1,Eingabe!G337,\"\"))","v":""}]
[336,{"$f":"IF($M$1=\"\",\"\",IF($D341=$M$1,Eingabe!B338,\"\"))","v":""},{"$f":"IF($M$1=\"\",\"\",IF($D341=$M$1,Eingabe!C338,\"\"))","v":""},{"$f":"IF(Eingabe!$A338=$M$1,$M$1,\"\")","v":""},{"$f":"IF($M$1=\"\",\"\",IF($D341=$M$1,Eingabe!G338,\"\"))","v":""}]
[337,{"$f":"IF($M$1=\"\",\"\",IF($D342=$M$1,Eingabe!B339,\"\"))","v":""},{"$f":"IF($M$1=\"\",\"\",IF($D342=$M$1,Eingabe!C339,\"\"))","v":""},{"$f":"IF(Eingabe!$A339=$M$1,$M$1,\"\")","v":""},{"$f":"IF($M$1=\"\",\"\",IF($D342=$M$1,Eingabe!G339,\"\"))","v":""}]
[338,{"$f":"IF($M$1=\"\",\"\",IF($D343=$M$1,Eingabe!B340,\"\"))","v":""},{"$f":"IF($M$1=\"\",\"\",IF($D343=$M$1,Eingabe!C340,\"\"))","v":""},{"$f":"IF(Eingabe!$A340=$M$1,$M$1,\"\")","v":""},{"$f":"IF($M$1=\"\",\"\",IF($D343=$M$1,Eingabe!G340,\"\"))","v":""}]
[339,{"$f":"IF($M$1=\"\",\"\",IF($D344=$M$1,Eingabe!B341,\"\"))","v":""},{"$f":"IF($M$1=\"\",\"\",IF($D344=$M$1,Eingabe!C341,\"\"))","v":""},{"$f":"IF(Eingabe!$A341=$M$1,$M$1,\"\")","v":""},{"$f":"IF($M$1=\"\",\"\",IF($D344=$M$1,Eingabe!G341,\"\"))","v":""}]
[340,{"$f":"IF($M$1=\"\",\"\",IF($D345=$M$1,Eingabe!B342,\"\"))","v":""},{"$f":"IF($M$1=\"\",\"\",IF($D345=$M$1,Eingabe!C342,\"\"))","v":""},{"$f":"IF(Eingabe!$A342=$M$1,$M$1,\"\")","v":""},{"$f":"IF($M$1=\"\",\"\",IF($D345=$M$1,Eingabe!G342,\"\"))","v":""}]
[341,{"$f":"IF($M$1=\"\",\"\",IF($D346=$M$1,Eingabe!B343,\"\"))","v":""},{"$f":"IF($M$1=\"\",\"\",IF($D346=$M$1,Eingabe!C343,\"\"))","v":""},{"$f":"IF(Eingabe!$A343=$M$1,$M$1,\"\")","v":""},{"$f":"IF($M$1=\"\",\"\",IF($D346=$M$1,Eingabe!G343,\"\"))","v":""}]
[342,{"$f":"IF($M$1=\"\",\"\",IF($D347=$M$1,Eingabe!B344,\"\"))","v":""},{"$f":"IF($M$1=\"\",\"\",IF($D347=$M$1,Eingabe!C344,\"\"))","v":""},{"$f":"IF(Eingabe!$A344=$M$1,$M$1,\"\")","v":""},{"$f":"IF($M$1=\"\",\"\",IF($D347=$M$1,Eingabe!G344,\"\"))","v":""}]
[343,{"$f":"IF($M$1=\"\",\"\",IF($D348=$M$1,Eingabe!B345,\"\"))","v":""},{"$f":"IF($M$1=\"\",\"\",IF($D348=$M$1,Eingabe!C345,\"\"))","v":""},{"$f":"IF(Eingabe!$A345=$M$1,$M$1,\"\")","v":""},{"$f":"IF($M$1=\"\",\"\",IF($D348=$M$1,Eingabe!G345,\"\"))","v":""}]
[344,{"$f":"IF($M$1=\"\",\"\",IF($D349=$M$1,Eingabe!B346,\"\"))","v":""},{"$f":"IF($M$1=\"\",\"\",IF($D349=$M$1,Eingabe!C346,\"\"))","v":""},{"$f":"IF(Eingabe!$A346=$M$1,$M$1,\"\")","v":""},{"$f":"IF($M$1=\"\",\"\",IF($D349=$M$1,Eingabe!G346,\"\"))","v":""}]
[345,{"$f":"IF($M$1=\"\",\"\",IF($D350=$M$1,Eingabe!B347,\"\"))","v":""},{"$f":"IF($M$1=\"\",\"\",IF($D350=$M$1,Eingabe!C347,\"\"))","v":""},{"$f":"IF(Eingabe!$A347=$M$1,$M$1,\"\")","v":""},{"$f":"IF($M$1=\"\",\"\",IF($D350=$M$1,Eingabe!G347,\"\"))","v":""}]
[346,{"$f":"IF($M$1=\"\",\"\",IF($D351=$M$1,Eingabe!B348,\"\"))","v":""},{"$f":"IF($M$1=\"\",\"\",IF($D351=$M$1,Eingabe!C348,\"\"))","v":""},{"$f":"IF(Eingabe!$A348=$M$1,$M$1,\"\")","v":""},{"$f":"IF($M$1=\"\",\"\",IF($D351=$M$1,Eingabe!G348,\"\"))","v":""}]
[347,{"$f":"IF($M$1=\"\",\"\",IF($D352=$M$1,Eingabe!B349,\"\"))","v":""},{"$f":"IF($M$1=\"\",\"\",IF($D352=$M$1,Eingabe!C349,\"\"))","v":""},{"$f":"IF(Eingabe!$A349=$M$1,$M$1,\"\")","v":""},{"$f":"IF($M$1=\"\",\"\",IF($D352=$M$1,Eingabe!G349,\"\"))","v":""}]
[348,{"$f":"IF($M$1=\"\",\"\",IF($D353=$M$1,Eingabe!B350,\"\"))","v":""},{"$f":"IF($M$1=\"\",\"\",IF($D353=$M$1,Eingabe!C350,\"\"))","v":""},{"$f":"IF(Eingabe!$A350=$M$1,$M$1,\"\")","v":""},{"$f":"IF($M$1=\"\",\"\",IF($D353=$M$1,Eingabe!G350,\"\"))","v":""}]
[349,{"$f":"IF($M$1=\"\",\"\",IF($D354=$M$1,Eingabe!B351,\"\"))","v":""},{"$f":"IF($M$1=\"\",\"\",IF($D354=$M$1,Eingabe!C351,\"\"))","v":""},{"$f":"IF(Eingabe!$A351=$M$1,$M$1,\"\")","v":""},{"$f":"IF($M$1=\"\",\"\",IF($D354=$M$1,Eingabe!G351,\"\"))","v":""}]
[350,{"$f":"IF($M$1=\"\",\"\",IF($D355=$M$1,Eingabe!B352,\"\"))","v":""},{"$f":"IF($M$1=\"\",\"\",IF($D355=$M$1,Eingabe!C352,\"\"))","v":""},{"$f":"IF(Eingabe!$A352=$M$1,$M$1,\"\")","v":""},{"$f":"IF($M$1=\"\",\"\",IF($D355=$M$1,Eingabe!G352,\"\"))","v":""}]
[351,{"$f":"IF($M$1=\"\",\"\",IF($D356=$M$1,Eingabe!B353,\"\"))","v":""},{"$f":"IF($M$1=\"\",\"\",IF($D356=$M$1,Eingabe!C353,\"\"))","v":""},{"$f":"IF(Eingabe!$A353=$M$1,$M$1,\"\")","v":""},{"$f":"IF($M$1=\"\",\"\",IF($D356=$M$1,Eingabe!G353,\"\"))","v":""}]
[352,{"$f":"IF($M$1=\"\",\"\",IF($D357=$M$1,Eingabe!B354,\"\"))","v":""},{"$f":"IF($M$1=\"\",\"\",IF($D357=$M$1,Eingabe!C354,\"\"))","v":""},{"$f":"IF(Eingabe!$A354=$M$1,$M$1,\"\")","v":""},{"$f":"IF($M$1=\"\",\"\",IF($D357=$M$1,Eingabe!G354,\"\"))","v":""}]
[353,{"$f":"IF($M$1=\"\",\"\",IF($D358=$M$1,Eingabe!B355,\"\"))","v":""},{"$f":"IF($M$1=\"\",\"\",IF($D358=$M$1,Eingabe!C355,\"\"))","v":""},{"$f":"IF(Eingabe!$A355=$M$1,$M$1,\"\")","v":""},{"$f":"IF($M$1=\"\",\"\",IF($D358=$M$1,Eingabe!G355,\"\"))","v":""}]
[354,{"$f":"IF($M$1=\"\",\"\",IF($D359=$M$1,Eingabe!B356,\"\"))","v":""},{"$f":"IF($M$1=\"\",\"\",IF($D359=$M$1,Eingabe!C356,\"\"))","v":""},{"$f":"IF(Eingabe!$A356=$M$1,$M$1,\"\")","v":""},{"$f":"IF($M$1=\"\",\"\",IF($D359=$M$1,Eingabe!G356,\"\"))","v":""}]
[355,{"$f":"IF($M$1=\"\",\"\",IF($D360=$M$1,Eingabe!B357,\"\"))","v":""},{"$f":"IF($M$1=\"\",\"\",IF($D360=$M$1,Eingabe!C357,\"\"))","v":""},{"$f":"IF(Eingabe!$A357=$M$1,$M$1,\"\")","v":""},{"$f":"IF($M$1=\"\",\"\",IF($D360=$M$1,Eingabe!G357,\"\"))","v":""}]
[356,{"$f":"IF($M$1=\"\",\"\",IF($D361=$M$1,Eingabe!B358,\"\"))","v":""},{"$f":"IF($M$1=\"\",\"\",IF($D361=$M$1,Eingabe!C358,\"\"))","v":""},{"$f":"IF(Eingabe!$A358=$M$1,$M$1,\"\")","v":""},{"$f":"IF($M$1=\"\",\"\",IF($D361=$M$1,Eingabe!G358,\"\"))","v":""}]
[357,{"$f":"IF($M$1=\"\",\"\",IF($D362=$M$1,Eingabe!B359,\"\"))","v":""},{"$f":"IF($M$1=\"\",\"\",IF($D362=$M$1,Eingabe!C359,\"\"))","v":""},{"$f":"IF(Eingabe!$A359=$M$1,$M$1,\"\")","v":""},{"$f":"IF($M$1=\"\",\"\",IF($D362=$M$1,Eingabe!G359,\"\"))","v":""}]
[358,{"$f":"IF($M$1=\"\",\"\",IF($D363=$M$1,Eingabe!B360,\"\"))","v":""},{"$f":"IF($M$1=\"\",\"\",IF($D363=$M$1,Eingabe!C360,\"\"))","v":""},{"$f":"IF(Eingabe!$A360=$M$1,$M$1,\"\")","v":""},{"$f":"IF($M$1=\"\",\"\",IF($D363=$M$1,Eingabe!G360,\"\"))","v":""}]
[359,{"$f":"IF($M$1=\"\",\"\",IF($D364=$M$1,Eingabe!B361,\"\"))","v":""},{"$f":"IF($M$1=\"\",\"\",IF($D364=$M$1,Eingabe!C361,\"\"))","v":""},{"$f":"IF(Eingabe!$A361=$M$1,$M$1,\"\")","v":""},{"$f":"IF($M$1=\"\",\"\",IF($D364=$M$1,Eingabe!G361,\"\"))","v":""}]
[360,{"$f":"IF($M$1=\"\",\"\",IF($D365=$M$1,Eingabe!B362,\"\"))","v":""},{"$f":"IF($M$1=\"\",\"\",IF($D365=$M$1,Eingabe!C362,\"\"))","v":""},{"$f":"IF(Eingabe!$A362=$M$1,$M$1,\"\")","v":""},{"$f":"IF($M$1=\"\",\"\",IF($D365=$M$1,Eingabe!G362,\"\"))","v":""}]
[361,{"$f":"IF($M$1=\"\",\"\",IF($D366=$M$1,Eingabe!B363,\"\"))","v":""},{"$f":"IF($M$1=\"\",\"\",IF($D366=$M$1,Eingabe!C363,\"\"))","v":""},{"$f":"IF(Eingabe!$A363=$M$1,$M$1,\"\")","v":""},{"$f":"IF($M$1=\"\",\"\",IF($D366=$M$1,Eingabe!G363,\"\"))","v":""}]
[362,{"$f":"IF($M$1=\"\",\"\",IF($D367=$M$1,Eingabe!B364,\"\"))","v":""},{"$f":"IF($M$1=\"\",\"\",IF($D367=$M$1,Eingabe!C364,\"\"))","v":""},{"$f":"IF(Eingabe!$A364=$M$1,$M$1,\"\")","v":""},{"$f":"IF($M$1=\"\",\"\",IF($D367=$M$1,Eingabe!G364,\"\"))","v":""}]
[363,{"$f":"IF($M$1=\"\",\"\",IF($D368=$M$1,Eingabe!B365,\"\"))","v":""},{"$f":"IF($M$1=\"\",\"\",IF($D368=$M$1,Eingabe!C365,\"\"))","v":""},{"$f":"IF(Eingabe!$A365=$M$1,$M$1,\"\")","v":""},{"$f":"IF($M$1=\"\",\"\",IF($D368=$M$1,Eingabe!G365,\"\"))","v":""}]
[364,{"$f":"IF($M$1=\"\",\"\",IF($D369=$M$1,Eingabe!B366,\"\"))","v":""},{"$f":"IF($M$1=\"\",\"\",IF($D369=$M$1,Eingabe!C366,\"\"))","v":""},{"$f":"IF(Eingabe!$A366=$M$1,$M$1,\"\")","v":""},{"$f":"IF($M$1=\"\",\"\",IF($D369=$M$1,Eingabe!G366,\"\"))","v":""}]
[365,{"$f":"IF($M$1=\"\",\"\",IF($D370=$M$1,Eingabe!B367,\"\"))","v":""},{"$f":"IF($M$1=\"\",\"\",IF($D370=$M$1,Eingabe!C367,\"\"))","v":""},{"$f":"IF(Eingabe!$A367=$M$1,$M$1,\"\")","v":""},{"$f":"IF($M$1=\"\",\"\",IF($D370=$M$1,Eingabe!G367,\"\"))","v":""}]
[366,{"$f":"IF($M$1=\"\",\"\",IF($D371=$M$1,Eingabe!B368,\"\"))","v":""},{"$f":"IF($M$1=\"\",\"\",IF($D371=$M$1,Eingabe!C368,\"\"))","v":""},{"$f":"IF(Eingabe!$A368=$M$1,$M$1,\"\")","v":""},{"$f":"IF($M$1=\"\",\"\",IF($D371=$M$1,Eingabe!G368,\"\"))","v":""}]
[367,{"$f":"IF($M$1=\"\",\"\",IF($D372=$M$1,Eingabe!B369,\"\"))","v":""},{"$f":"IF($M$1=\"\",\"\",IF($D372=$M$1,Eingabe!C369,\"\"))","v":""},{"$f":"IF(Eingabe!$A369=$M$1,$M$1,\"\")","v":""},{"$f":"IF($M$1=\"\",\"\",IF($D372=$M$1,Eingabe!G369,\"\"))","v":""}]
[368,{"$f":"IF($M$1=\"\",\"\",IF($D373=$M$1,Eingabe!B370,\"\"))","v":""},{"$f":"IF($M$1=\"\",\"\",IF($D373=$M$1,Eingabe!C370,\"\"))","v":""},{"$f":"IF(Eingabe!$A370=$M$1,$M$1,\"\")","v":""},{"$f":"IF($M$1=\"\",\"\",IF($D373=$M$1,Eingabe!G370,\"\"))","v":""}]
[369,{"$f":"IF($M$1=\"\",\"\",IF($D374=$M$1,Eingabe!B371,\"\"))","v":""},{"$f":"IF($M$1=\"\",\"\",IF($D374=$M$1,Eingabe!C371,\"\"))","v":""},{"$f":"IF(Eingabe!$A371=$M$1,$M$1,\"\")","v":""},{"$f":"IF($M$1=\"\",\"\",IF($D374=$M$1,Eingabe!G371,\"\"))","v":""}]
[370,{"$f":"IF($M$1=\"\",\"\",IF($D375=$M$1,Eingabe!B372,\"\"))","v":""},{"$f":"IF($M$1=\"\",\"\",IF($D375=$M$1,Eingabe!C372,\"\"))","v":""},{"$f":"IF(Eingabe!$A372=$M$1,$M$1,\"\")","v":""},{"$f":"IF($M$1=\"\",\"\",IF($D375=$M$1,Eingabe!G372,\"\"))","v":""}]
[371,{"$f":"IF($M$1=\"\",\"\",IF($D376=$M$1,Eingabe!B373,\"\"))","v":""},{"$f":"IF($M$1=\"\",\"\",IF($D376=$M$1,Eingabe!C373,\"\"))","v":""},{"$f":"IF(Eingabe!$A373=$M$1,$M$1,\"\")","v":""},{"$f":"IF($M$1=\"\",\"\",IF($D376=$M$1,Eingabe!G373,\"\"))","v":""}]
[372,{"$f":"IF($M$1=\"\",\"\",IF($D377=$M$1,Eingabe!B374,\"\"))","v":""},{"$f":"IF($M$1=\"\",\"\",IF($D377=$M$1,Eingabe!C374,\"\"))","v":""},{"$f":"IF(Eingabe!$A374=$M$1,$M$1,\"\")","v":""},{"$f":"IF($M$1=\"\",\"\",IF($D377=$M$1,Eingabe!G374,\"\"))","v":""}]
[373,{"$f":"IF($M$1=\"\",\"\",IF($D378=$M$1,Eingabe!B375,\"\"))","v":""},{"$f":"IF($M$1=\"\",\"\",IF($D378=$M$1,Eingabe!C375,\"\"))","v":""},{"$f":"IF(Eingabe!$A375=$M$1,$M$1,\"\")","v":""},{"$f":"IF($M$1=\"\",\"\",IF($D378=$M$1,Eingabe!G375,\"\"))","v":""}]
[374,{"$f":"IF($M$1=\"\",\"\",IF($D379=$M$1,Eingabe!B376,\"\"))","v":""},{"$f":"IF($M$1=\"\",\"\",IF($D379=$M$1,Eingabe!C376,\"\"))","v":""},{"$f":"IF(Eingabe!$A376=$M$1,$M$1,\"\")","v":""},{"$f":"IF($M$1=\"\",\"\",IF($D379=$M$1,Eingabe!G376,\"\"))","v":""}]
[375,{"$f":"IF($M$1=\"\",\"\",IF($D380=$M$1,Eingabe!B377,\"\"))","v":""},{"$f":"IF($M$1=\"\",\"\",IF($D380=$M$1,Eingabe!C377,\"\"))","v":""},{"$f":"IF(Eingabe!$A377=$M$1,$M$1,\"\")","v":""},{"$f":"IF($M$1=\"\",\"\",IF($D380=$M$1,Eingabe!G377,\"\"))","v":""}]
[376,{"$f":"IF($M$1=\"\",\"\",IF($D381=$M$1,Eingabe!B378,\"\"))","v":""},{"$f":"IF($M$1=\"\",\"\",IF($D381=$M$1,Eingabe!C378,\"\"))","v":""},{"$f":"IF(Eingabe!$A378=$M$1,$M$1,\"\")","v":""},{"$f":"IF($M$1=\"\",\"\",IF($D381=$M$1,Eingabe!G378,\"\"))","v":""}]
[377,{"$f":"IF($M$1=\"\",\"\",IF($D382=$M$1,Eingabe!B379,\"\"))","v":""},{"$f":"IF($M$1=\"\",\"\",IF($D382=$M$1,Eingabe!C379,\"\"))","v":""},{"$f":"IF(Eingabe!$A379=$M$1,$M$1,\"\")","v":""},{"$f":"IF($M$1=\"\",\"\",IF($D382=$M$1,Eingabe!G379,\"\"))","v":""}]
[378,{"$f":"IF($M$1=\"\",\"\",IF($D383=$M$1,Eingabe!B380,\"\"))","v":""},{"$f":"IF($M$1=\"\",\"\",IF($D383=$M$1,Eingabe!C380,\"\"))","v":""},{"$f":"IF(Eingabe!$A380=$M$1,$M$1,\"\")","v":""},{"$f":"IF($M$1=\"\",\"\",IF($D383=$M$1,Eingabe!G380,\"\"))","v":""}]
[379,{"$f":"IF($M$1=\"\",\"\",IF($D384=$M$1,Eingabe!B381,\"\"))","v":""},{"$f":"IF($M$1=\"\",\"\",IF($D384=$M$1,Eingabe!C381,\"\"))","v":""},{"$f":"IF(Eingabe!$A381=$M$1,$M$1,\"\")","v":""},{"$f":"IF($M$1=\"\",\"\",IF($D384=$M$1,Eingabe!G381,\"\"))","v":""}]
[380,{"$f":"IF($M$1=\"\",\"\",IF($D385=$M$1,Eingabe!B382,\"\"))","v":""},{"$f":"IF($M$1=\"\",\"\",IF($D385=$M$1,Eingabe!C382,\"\"))","v":""},{"$f":"IF(Eingabe!$A382=$M$1,$M$1,\"\")","v":""},{"$f":"IF($M$1=\"\",\"\",IF($D385=$M$1,Eingabe!G382,\"\"))","v":""}]
[381,{"$f":"IF($M$1=\"\",\"\",IF($D386=$M$1,Eingabe!B383,\"\"))","v":""},{"$f":"IF($M$1=\"\",\"\",IF($D386=$M$1,Eingabe!C383,\"\"))","v":""},{"$f":"IF(Eingabe!$A383=$M$1,$M$1,\"\")","v":""},{"$f":"IF($M$1=\"\",\"\",IF($D386=$M$1,Eingabe!G383,\"\"))","v":""}]
[382,{"$f":"IF($M$1=\"\",\"\",IF($D387=$M$1,Eingabe!B384,\"\"))","v":""},{"$f":"IF($M$1=\"\",\"\",IF($D387=$M$1,Eingabe!C384,\"\"))","v":""},{"$f":"IF(Eingabe!$A384=$M$1,$M$1,\"\")","v":""},{"$f":"IF($M$1=\"\",\"\",IF($D387=$M$1,Eingabe!G384,\"\"))","v":""}]
[383,{"$f":"IF($M$1=\"\",\"\",IF($D388=$M$1,Eingabe!B385,\"\"))","v":""},{"$f":"IF($M$1=\"\",\"\",IF($D388=$M$1,Eingabe!C385,\"\"))","v":""},{"$f":"IF(Eingabe!$A385=$M$1,$M$1,\"\")","v":""},{"$f":"IF($M$1=\"\",\"\",IF($D388=$M$1,Eingabe!G385,\"\"))","v":""}]
[384,{"$f":"IF($M$1=\"\",\"\",IF($D389=$M$1,Eingabe!B386,\"\"))","v":""},{"$f":"IF($M$1=\"\",\"\",IF($D389=$M$1,Eingabe!C386,\"\"))","v":""},{"$f":"IF(Eingabe!$A386=$M$1,$M$1,\"\")","v":""},{"$f":"IF($M$1=\"\",\"\",IF($D389=$M$1,Eingabe!G386,\"\"))","v":""}]
[385,{"$f":"IF($M$1=\"\",\"\",IF($D390=$M$1,Eingabe!B387,\"\"))","v":""},{"$f":"IF($M$1=\"\",\"\",IF($D390=$M$1,Eingabe!C387,\"\"))","v":""},{"$f":"IF(Eingabe!$A387=$M$1,$M$1,\"\")","v":""},{"$f":"IF($M$1=\"\",\"\",IF($D390=$M$1,Eingabe!G387,\"\"))","v":""}]
[386,{"$f":"IF($M$1=\"\",\"\",IF($D391=$M$1,Eingabe!B388,\"\"))","v":""},{"$f":"IF($M$1=\"\",\"\",IF($D391=$M$1,Eingabe!C388,\"\"))","v":""},{"$f":"IF(Eingabe!$A388=$M$1,$M$1,\"\")","v":""},{"$f":"IF($M$1=\"\",\"\",IF($D391=$M$1,Eingabe!G388,\"\"))","v":""}]
[387,{"$f":"IF($M$1=\"\",\"\",IF($D392=$M$1,Eingabe!B389,\"\"))","v":""},{"$f":"IF($M$1=\"\",\"\",IF($D392=$M$1,Eingabe!C389,\"\"))","v":""},{"$f":"IF(Eingabe!$A389=$M$1,$M$1,\"\")","v":""},{"$f":"IF($M$1=\"\",\"\",IF($D392=$M$1,Eingabe!G389,\"\"))","v":""}]
[388,{"$f":"IF($M$1=\"\",\"\",IF($D393=$M$1,Eingabe!B390,\"\"))","v":""},{"$f":"IF($M$1=\"\",\"\",IF($D393=$M$1,Eingabe!C390,\"\"))","v":""},{"$f":"IF(Eingabe!$A390=$M$1,$M$1,\"\")","v":""},{"$f":"IF($M$1=\"\",\"\",IF($D393=$M$1,Eingabe!G390,\"\"))","v":""}]
[389,{"$f":"IF($M$1=\"\",\"\",IF($D394=$M$1,Eingabe!B391,\"\"))","v":""},{"$f":"IF($M$1=\"\",\"\",IF($D394=$M$1,Eingabe!C391,\"\"))","v":""},{"$f":"IF(Eingabe!$A391=$M$1,$M$1,\"\")","v":""},{"$f":"IF($M$1=\"\",\"\",IF($D394=$M$1,Eingabe!G391,\"\"))","v":""}]
[390,{"$f":"IF($M$1=\"\",\"\",IF($D395=$M$1,Eingabe!B392,\"\"))","v":""},{"$f":"IF($M$1=\"\",\"\",IF($D395=$M$1,Eingabe!C392,\"\"))","v":""},{"$f":"IF(Eingabe!$A392=$M$1,$M$1,\"\")","v":""},{"$f":"IF($M$1=\"\",\"\",IF($D395=$M$1,Eingabe!G392,\"\"))","v":""}]
[391,{"$f":"IF($M$1=\"\",\"\",IF($D396=$M$1,Eingabe!B393,\"\"))","v":""},{"$f":"IF($M$1=\"\",\"\",IF($D396=$M$1,Eingabe!C393,\"\"))","v":""},{"$f":"IF(Eingabe!$A393=$M$1,$M$1,\"\")","v":""},{"$f":"IF($M$1=\"\",\"\",IF($D396=$M$1,Eingabe!G393,\"\"))","v":""}]
[392,{"$f":"IF($M$1=\"\",\"\",IF($D397=$M$1,Eingabe!B394,\"\"))","v":""},{"$f":"IF($M$1=\"\",\"\",IF($D397=$M$1,Eingabe!C394,\"\"))","v":""},{"$f":"IF(Eingabe!$A394=$M$1,$M$1,\"\")","v":""},{"$f":"IF($M$1=\"\",\"\",IF($D397=$M$1,Eingabe!G394,\"\"))","v":""}]
[393,{"$f":"IF($M$1=\"\",\"\",IF($D398=$M$1,Eingabe!B395,\"\"))","v":""},{"$f":"IF($M$1=\"\",\"\",IF($D398=$M$1,Eingabe!C395,\"\"))","v":""},{"$f":"IF(Eingabe!$A395=$M$1,$M$1,\"\")","v":""},{"$f":"IF($M$1=\"\",\"\",IF($D398=$M$1,Eingabe!G395,\"\"))","v":""}]
[394,{"$f":"IF($M$1=\"\",\"\",IF($D399=$M$1,Eingabe!B396,\"\"))","v":""},{"$f":"IF($M$1=\"\",\"\",IF($D399=$M$1,Eingabe!C396,\"\"))","v":""},{"$f":"IF(Eingabe!$A396=$M$1,$M$1,\"\")","v":""},{"$f":"IF($M$1=\"\",\"\",IF($D399=$M$1,Eingabe!G396,\"\"))","v":""}]
[395,{"$f":"IF($M$1=\"\",\"\",IF($D400=$M$1,Eingabe!B397,\"\"))","v":""},{"$f":"IF($M$1=\"\",\"\",IF($D400=$M$1,Eingabe!C397,\"\"))","v":""},{"$f":"IF(Eingabe!$A397=$M$1,$M$1,\"\")","v":""},{"$f":"IF($M$1=\"\",\"\",IF($D400=$M$1,Eingabe!G397,\"\"))","v":""}]
[396,{"$f":"IF($M$1=\"\",\"\",IF($D401=$M$1,Eingabe!B398,\"\"))","v":""},{"$f":"IF($M$1=\"\",\"\",IF($D401=$M$1,Eingabe!C398,\"\"))","v":""},{"$f":"IF(Eingabe!$A398=$M$1,$M$1,\"\")","v":""},{"$f":"IF($M$1=\"\",\"\",IF($D401=$M$1,Eingabe!G398,\"\"))","v":""}]
[397,{"$f":"IF($M$1=\"\",\"\",IF($D402=$M$1,Eingabe!B399,\"\"))","v":""},{"$f":"IF($M$1=\"\",\"\",IF($D402=$M$1,Eingabe!C399,\"\"))","v":""},{"$f":"IF(Eingabe!$A399=$M$1,$M$1,\"\")","v":""},{"$f":"IF($M$1=\"\",\"\",IF($D402=$M$1,Eingabe!G399,\"\"))","v":""}]
[398,{"$f":"IF($M$1=\"\",\"\",IF($D403=$M$1,Eingabe!B400,\"\"))","v":""},{"$f":"IF($M$1=\"\",\"\",IF($D403=$M$1,Eingabe!C400,\"\"))","v":""},{"$f":"IF(Eingabe!$A400=$M$1,$M$1,\"\")","v":""},{"$f":"IF($M$1=\"\",\"\",IF($D403=$M$1,Eingabe!G400,\"\"))","v":""}]
[399,{"$f":"IF($M$1=\"\",\"\",IF($D404=$M$1,Eingabe!B401,\"\"))","v":""},{"$f":"IF($M$1=\"\",\"\",IF($D404=$M$1,Eingabe!C401,\"\"))","v":""},{"$f":"IF(Eingabe!$A401=$M$1,$M$1,\"\")","v":""},{"$f":"IF($M$1=\"\",\"\",IF($D404=$M$1,Eingabe!G401,\"\"))","v":""}]
[400,{"$f":"IF($M$1=\"\",\"\",IF($D405=$M$1,Eingabe!B402,\"\"))","v":""},{"$f":"IF($M$1=\"\",\"\",IF($D405=$M$1,Eingabe!C402,\"\"))","v":""},{"$f":"IF(Eingabe!$A402=$M$1,$M$1,\"\")","v":""},{"$f":"IF($M$1=\"\",\"\",IF($D405=$M$1,Eingabe!G402,\"\"))","v":""}]
[401,{"$f":"IF($M$1=\"\",\"\",IF($D406=$M$1,Eingabe!B403,\"\"))","v":""},{"$f":"IF($M$1=\"\",\"\",IF($D406=$M$1,Eingabe!C403,\"\"))","v":""},{"$f":"IF(Eingabe!$A403=$M$1,$M$1,\"\")","v":""},{"$f":"IF($M$1=\"\",\"\",IF($D406=$M$1,Eingabe!G403,\"\"))","v":""}]
[402,{"$f":"IF($M$1=\"\",\"\",IF($D407=$M$1,Eingabe!B404,\"\"))","v":""},{"$f":"IF($M$1=\"\",\"\",IF($D407=$M$1,Eingabe!C404,\"\"))","v":""},{"$f":"IF(Eingabe!$A404=$M$1,$M$1,\"\")","v":""},{"$f":"IF($M$1=\"\",\"\",IF($D407=$M$1,Eingabe!G404,\"\"))","v":""}]
[403,{"$f":"IF($M$1=\"\",\"\",IF($D408=$M$1,Eingabe!B405,\"\"))","v":""},{"$f":"IF($M$1=\"\",\"\",IF($D408=$M$1,Eingabe!C405,\"\"))","v":""},{"$f":"IF(Eingabe!$A405=$M$1,$M$1,\"\")","v":""},{"$f":"IF($M$1=\"\",\"\",IF($D408=$M$1,Eingabe!G405,\"\"))","v":""}]
[404,{"$f":"IF($M$1=\"\",\"\",IF($D409=$M$1,Eingabe!B406,\"\"))","v":""},{"$f":"IF($M$1=\"\",\"\",IF($D409=$M$1,Eingabe!C406,\"\"))","v":""},{"$f":"IF(Eingabe!$A406=$M$1,$M$1,\"\")","v":""},{"$f":"IF($M$1=\"\",\"\",IF($D409=$M$1,Eingabe!G406,\"\"))","v":""}]
[405,{"$f":"IF($M$1=\"\",\"\",IF($D410=$M$1,Eingabe!B407,\"\"))","v":""},{"$f":"IF($M$1=\"\",\"\",IF($D410=$M$1,Eingabe!C407,\"\"))","v":""},{"$f":"IF(Eingabe!$A407=$M$1,$M$1,\"\")","v":""},{"$f":"IF($M$1=\"\",\"\",IF($D410=$M$1,Eingabe!G407,\"\"))","v":""}]
[406,{"$f":"IF($M$1=\"\",\"\",IF($D411=$M$1,Eingabe!B408,\"\"))","v":""},{"$f":"IF($M$1=\"\",\"\",IF($D411=$M$1,Eingabe!C408,\"\"))","v":""},{"$f":"IF(Eingabe!$A408=$M$1,$M$1,\"\")","v":""},{"$f":"IF($M$1=\"\",\"\",IF($D411=$M$1,Eingabe!G408,\"\"))","v":""}]
[407,{"$f":"IF($M$1=\"\",\"\",IF($D412=$M$1,Eingabe!B409,\"\"))","v":""},{"$f":"IF($M$1=\"\",\"\",IF($D412=$M$1,Eingabe!C409,\"\"))","v":""},{"$f":"IF(Eingabe!$A409=$M$1,$M$1,\"\")","v":""},{"$f":"IF($M$1=\"\",\"\",IF($D412=$M$1,Eingabe!G409,\"\"))","v":""}]
[408,{"$f":"IF($M$1=\"\",\"\",IF($D413=$M$1,Eingabe!B410,\"\"))","v":""},{"$f":"IF($M$1=\"\",\"\",IF($D413=$M$1,Eingabe!C410,\"\"))","v":""},{"$f":"IF(Eingabe!$A410=$M$1,$M$1,\"\")","v":""},{"$f":"IF($M$1=\"\",\"\",IF($D413=$M$1,Eingabe!G410,\"\"))","v":""}]
[409,{"$f":"IF($M$1=\"\",\"\",IF($D414=$M$1,Eingabe!B411,\"\"))","v":""},{"$f":"IF($M$1=\"\",\"\",IF($D414=$M$1,Eingabe!C411,\"\"))","v":""},{"$f":"IF(Eingabe!$A411=$M$1,$M$1,\"\")","v":""},{"$f":"IF($M$1=\"\",\"\",IF($D414=$M$1,Eingabe!G411,\"\"))","v":""}]
[410,{"$f":"IF($M$1=\"\",\"\",IF($D415=$M$1,Eingabe!B412,\"\"))","v":""},{"$f":"IF($M$1=\"\",\"\",IF($D415=$M$1,Eingabe!C412,\"\"))","v":""},{"$f":"IF(Eingabe!$A412=$M$1,$M$1,\"\")","v":""},{"$f":"IF($M$1=\"\",\"\",IF($D415=$M$1,Eingabe!G412,\"\"))","v":""}]
[411,{"$f":"IF($M$1=\"\",\"\",IF($D416=$M$1,Eingabe!B413,\"\"))","v":""},{"$f":"IF($M$1=\"\",\"\",IF($D416=$M$1,Eingabe!C413,\"\"))","v":""},{"$f":"IF(Eingabe!$A413=$M$1,$M$1,\"\")","v":""},{"$f":"IF($M$1=\"\",\"\",IF($D416=$M$1,Eingabe!G413,\"\"))","v":""}]
[412,{"$f":"IF($M$1=\"\",\"\",IF($D417=$M$1,Eingabe!B414,\"\"))","v":""},{"$f":"IF($M$1=\"\",\"\",IF($D417=$M$1,Eingabe!C414,\"\"))","v":""},{"$f":"IF(Eingabe!$A414=$M$1,$M$1,\"\")","v":""},{"$f":"IF($M$1=\"\",\"\",IF($D417=$M$1,Eingabe!G414,\"\"))","v":""}]
[413,{"$f":"IF($M$1=\"\",\"\",IF($D418=$M$1,Eingabe!B415,\"\"))","v":""},{"$f":"IF($M$1=\"\",\"\",IF($D418=$M$1,Eingabe!C415,\"\"))","v":""},{"$f":"IF(Eingabe!$A415=$M$1,$M$1,\"\")","v":""},{"$f":"IF($M$1=\"\",\"\",IF($D418=$M$1,Eingabe!G415,\"\"))","v":""}]
[414,{"$f":"IF($M$1=\"\",\"\",IF($D419=$M$1,Eingabe!B416,\"\"))","v":""},{"$f":"IF($M$1=\"\",\"\",IF($D419=$M$1,Eingabe!C416,\"\"))","v":""},{"$f":"IF(Eingabe!$A416=$M$1,$M$1,\"\")","v":""},{"$f":"IF($M$1=\"\",\"\",IF($D419=$M$1,Eingabe!G416,\"\"))","v":""}]
[415,{"$f":"IF($M$1=\"\",\"\",IF($D420=$M$1,Eingabe!B417,\"\"))","v":""},{"$f":"IF($M$1=\"\",\"\",IF($D420=$M$1,Eingabe!C417,\"\"))","v":""},{"$f":"IF(Eingabe!$A417=$M$1,$M$1,\"\")","v":""},{"$f":"IF($M$1=\"\",\"\",IF($D420=$M$1,Eingabe!G417,\"\"))","v":""}]
[416,{"$f":"IF($M$1=\"\",\"\",IF($D421=$M$1,Eingabe!B418,\"\"))","v":""},{"$f":"IF($M$1=\"\",\"\",IF($D421=$M$1,Eingabe!C418,\"\"))","v":""},{"$f":"IF(Eingabe!$A418=$M$1,$M$1,\"\")","v":""},{"$f":"IF($M$1=\"\",\"\",IF($D421=$M$1,Eingabe!G418,\"\"))","v":""}]
[417,{"$f":"IF($M$1=\"\",\"\",IF($D422=$M$1,Eingabe!B419,\"\"))","v":""},{"$f":"IF($M$1=\"\",\"\",IF($D422=$M$1,Eingabe!C419,\"\"))","v":""},{"$f":"IF(Eingabe!$A419=$M$1,$M$1,\"\")","v":""},{"$f":"IF($M$1=\"\",\"\",IF($D422=$M$1,Eingabe!G419,\"\"))","v":""}]
[418,{"$f":"IF($M$1=\"\",\"\",IF($D423=$M$1,Eingabe!B420,\"\"))","v":""},{"$f":"IF($M$1=\"\",\"\",IF($D423=$M$1,Eingabe!C420,\"\"))","v":""},{"$f":"IF(Eingabe!$A420=$M$1,$M$1,\"\")","v":""},{"$f":"IF($M$1=\"\",\"\",IF($D423=$M$1,Eingabe!G420,\"\"))","v":""}]
[419,{"$f":"IF($M$1=\"\",\"\",IF($D424=$M$1,Eingabe!B421,\"\"))","v":""},{"$f":"IF($M$1=\"\",\"\",IF($D424=$M$1,Eingabe!C421,\"\"))","v":""},{"$f":"IF(Eingabe!$A421=$M$1,$M$1,\"\")","v":""},{"$f":"IF($M$1=\"\",\"\",IF($D424=$M$1,Eingabe!G421,\"\"))","v":""}]
[420,{"$f":"IF($M$1=\"\",\"\",IF($D425=$M$1,Eingabe!B422,\"\"))","v":""},{"$f":"IF($M$1=\"\",\"\",IF($D425=$M$1,Eingabe!C422,\"\"))","v":""},{"$f":"IF(Eingabe!$A422=$M$1,$M$1,\"\")","v":""},{"$f":"IF($M$1=\"\",\"\",IF($D425=$M$1,Eingabe!G422,\"\"))","v":""}]
[421,{"$f":"IF($M$1=\"\",\"\",IF($D426=$M$1,Eingabe!B423,\"\"))","v":""},{"$f":"IF($M$1=\"\",\"\",IF($D426=$M$1,Eingabe!C423,\"\"))","v":""},{"$f":"IF(Eingabe!$A423=$M$1,$M$1,\"\")","v":0},{"$f":"IF($M$1=\"\",\"\",IF($D426=$M$1,Eingabe!G423,\"\"))","v":""}]
[422,{"$f":"IF($M$1=\"\",\"\",IF($D427=$M$1,Eingabe!B424,\"\"))","v":""},{"$f":"IF($M$1=\"\",\"\",IF($D427=$M$1,Eingabe!C424,\"\"))","v":""},{"$f":"IF(Eingabe!$A424=$M$1,$M$1,\"\")","v":0},{"$f":"IF($M$1=\"\",\"\",IF($D427=$M$1,Eingabe!G424,\"\"))","v":""}]
[423,{"$f":"IF($M$1=\"\",\"\",IF($D428=$M$1,Eingabe!B425,\"\"))","v":""},{"$f":"IF($M$1=\"\",\"\",IF($D428=$M$1,Eingabe!C425,\"\"))","v":""},{"$f":"IF(Eingabe!$A425=$M$1,$M$1,\"\")","v":0},{"$f":"IF($M$1=\"\",\"\",IF($D428=$M$1,Eingabe!G425,\"\"))","v":""}]
[424,{"$f":"IF($M$1=\"\",\"\",IF($D429=$M$1,Eingabe!B426,\"\"))","v":""},{"$f":"IF($M$1=\"\",\"\",IF($D429=$M$1,Eingabe!C426,\"\"))","v":""},{"$f":"IF(Eingabe!$A426=$M$1,$M$1,\"\")","v":0},{"$f":"IF($M$1=\"\",\"\",IF($D429=$M$1,Eingabe!G426,\"\"))","v":""}]
[425,{"$f":"IF($M$1=\"\",\"\",IF($D430=$M$1,Eingabe!B427,\"\"))","v":""},{"$f":"IF($M$1=\"\",\"\",IF($D430=$M$1,Eingabe!C427,\"\"))","v":""},{"$f":"IF(Eingabe!$A427=$M$1,$M$1,\"\")","v":0},{"$f":"IF($M$1=\"\",\"\",IF($D430=$M$1,Eingabe!G427,\"\"))","v":""}]
[426,{"$f":"IF($M$1=\"\",\"\",IF($D431=$M$1,Eingabe!B428,\"\"))","v":""},{"$f":"IF($M$1=\"\",\"\",IF($D431=$M$1,Eingabe!C428,\"\"))","v":""},{"$f":"IF(Eingabe!$A428=$M$1,$M$1,\"\")","v":0},{"$f":"IF($M$1=\"\",\"\",IF($D431=$M$1,Eingabe!G428,\"\"))","v":""}]
[427,{"$f":"IF($M$1=\"\",\"\",IF($D432=$M$1,Eingabe!B429,\"\"))","v":""},{"$f":"IF($M$1=\"\",\"\",IF($D432=$M$1,Eingabe!C429,\"\"))","v":""},{"$f":"IF(Eingabe!$A429=$M$1,$M$1,\"\")","v":0},{"$f":"IF($M$1=\"\",\"\",IF($D432=$M$1,Eingabe!G429,\"\"))","v":""}]
[428,{"$f":"IF($M$1=\"\",\"\",IF($D433=$M$1,Eingabe!B430,\"\"))","v":""},{"$f":"IF($M$1=\"\",\"\",IF($D433=$M$1,Eingabe!C430,\"\"))","v":""},{"$f":"IF(Eingabe!$A430=$M$1,$M$1,\"\")","v":0},{"$f":"IF($M$1=\"\",\"\",IF($D433=$M$1,Eingabe!G430,\"\"))","v":""}]
[429,{"$f":"IF($M$1=\"\",\"\",IF($D434=$M$1,Eingabe!B431,\"\"))","v":""},{"$f":"IF($M$1=\"\",\"\",IF($D434=$M$1,Eingabe!C431,\"\"))","v":""},{"$f":"IF(Eingabe!$A431=$M$1,$M$1,\"\")","v":0},{"$f":"IF($M$1=\"\",\"\",IF($D434=$M$1,Eingabe!G431,\"\"))","v":""}]
[430,{"$f":"IF($M$1=\"\",\"\",IF($D435=$M$1,Eingabe!B432,\"\"))","v":""},{"$f":"IF($M$1=\"\",\"\",IF($D435=$M$1,Eingabe!C432,\"\"))","v":""},{"$f":"IF(Eingabe!$A432=$M$1,$M$1,\"\")","v":0},{"$f":"IF($M$1=\"\",\"\",IF($D435=$M$1,Eingabe!G432,\"\"))","v":""}]
[431,{"$f":"IF($M$1=\"\",\"\",IF($D436=$M$1,Eingabe!B433,\"\"))","v":""},{"$f":"IF($M$1=\"\",\"\",IF($D436=$M$1,Eingabe!C433,\"\"))","v":""},{"$f":"IF(Eingabe!$A433=$M$1,$M$1,\"\")","v":0},{"$f":"IF($M$1=\"\",\"\",IF($D436=$M$1,Eingabe!G433,\"\"))","v":""}]
[432,{"$f":"IF($M$1=\"\",\"\",IF($D437=$M$1,Eingabe!B434,\"\"))","v":""},{"$f":"IF($M$1=\"\",\"\",IF($D437=$M$1,Eingabe!C434,\"\"))","v":""},{"$f":"IF(Eingabe!$A434=$M$1,$M$1,\"\")","v":0},{"$f":"IF($M$1=\"\",\"\",IF($D437=$M$1,Eingabe!G434,\"\"))","v":""}]
[433,{"$f":"IF($M$1=\"\",\"\",IF($D438=$M$1,Eingabe!B435,\"\"))","v":""},{"$f":"IF($M$1=\"\",\"\",IF($D438=$M$1,Eingabe!C435,\"\"))","v":""},{"$f":"IF(Eingabe!$A435=$M$1,$M$1,\"\")","v":0},{"$f":"IF($M$1=\"\",\"\",IF($D438=$M$1,Eingabe!G435,\"\"))","v":""}]
[434,{"$f":"IF($M$1=\"\",\"\",IF($D439=$M$1,Eingabe!B436,\"\"))","v":""},{"$f":"IF($M$1=\"\",\"\",IF($D439=$M$1,Eingabe!C436,\"\"))","v":""},{"$f":"IF(Eingabe!$A436=$M$1,$M$1,\"\")","v":0},{"$f":"IF($M$1=\"\",\"\",IF($D439=$M$1,Eingabe!G436,\"\"))","v":""}]
[435,{"$f":"IF($M$1=\"\",\"\",IF($D440=$M$1,Eingabe!B437,\"\"))","v":""},{"$f":"IF($M$1=\"\",\"\",IF($D440=$M$1,Eingabe!C437,\"\"))","v":""},{"$f":"IF(Eingabe!$A437=$M$1,$M$1,\"\")","v":0},{"$f":"IF($M$1=\"\",\"\",IF($D440=$M$1,Eingabe!G437,\"\"))","v":""}]
[436,{"$f":"IF($M$1=\"\",\"\",IF($D441=$M$1,Eingabe!B438,\"\"))","v":""},{"$f":"IF($M$1=\"\",\"\",IF($D441=$M$1,Eingabe!C438,\"\"))","v":""},{"$f":"IF(Eingabe!$A438=$M$1,$M$1,\"\")","v":0},{"$f":"IF($M$1=\"\",\"\",IF($D441=$M$1,Eingabe!G438,\"\"))","v":""}]
[437,{"$f":"IF($M$1=\"\",\"\",IF($D442=$M$1,Eingabe!B439,\"\"))","v":""},{"$f":"IF($M$1=\"\",\"\",IF($D442=$M$1,Eingabe!C439,\"\"))","v":""},{"$f":"IF(Eingabe!$A439=$M$1,$M$1,\"\")","v":0},{"$f":"IF($M$1=\"\",\"\",IF($D442=$M$1,Eingabe!G439,\"\"))","v":""}]
[438,{"$f":"IF($M$1=\"\",\"\",IF($D443=$M$1,Eingabe!B440,\"\"))","v":""},{"$f":"IF($M$1=\"\",\"\",IF($D443=$M$1,Eingabe!C440,\"\"))","v":""},{"$f":"IF(Eingabe!$A440=$M$1,$M$1,\"\")","v":0},{"$f":"IF($M$1=\"\",\"\",IF($D443=$M$1,Eingabe!G440,\"\"))","v":""}]
[439,{"$f":"IF($M$1=\"\",\"\",IF($D444=$M$1,Eingabe!B441,\"\"))","v":""},{"$f":"IF($M$1=\"\",\"\",IF($D444=$M$1,Eingabe!C441,\"\"))","v":""},{"$f":"IF(Eingabe!$A441=$M$1,$M$1,\"\")","v":0},{"$f":"IF($M$1=\"\",\"\",IF($D444=$M$1,Eingabe!G441,\"\"))","v":""}]
[440,{"$f":"IF($M$1=\"\",\"\",IF($D445=$M$1,Eingabe!B442,\"\"))","v":""},{"$f":"IF($M$1=\"\",\"\",IF($D445=$M$1,Eingabe!C442,\"\"))","v":""},{"$f":"IF(Eingabe!$A442=$M$1,$M$1,\"\")","v":0},{"$f":"IF($M$1=\"\",\"\",IF($D445=$M$1,Eingabe!G442,\"\"))","v":""}]
[441,{"$f":"IF($M$1=\"\",\"\",IF($D446=$M$1,Eingabe!B443,\"\"))","v":""},{"$f":"IF($M$1=\"\",\"\",IF($D446=$M$1,Eingabe!C443,\"\"))","v":""},{"$f":"IF(Eingabe!$A443=$M$1,$M$1,\"\")","v":0},{"$f":"IF($M$1=\"\",\"\",IF($D446=$M$1,Eingabe!G443,\"\"))","v":""}]
[442,{"$f":"IF($M$1=\"\",\"\",IF($D447=$M$1,Eingabe!B444,\"\"))","v":""},{"$f":"IF($M$1=\"\",\"\",IF($D447=$M$1,Eingabe!C444,\"\"))","v":""},{"$f":"IF(Eingabe!$A444=$M$1,$M$1,\"\")","v":0},{"$f":"IF($M$1=\"\",\"\",IF($D447=$M$1,Eingabe!G444,\"\"))","v":""}]
[443,{"$f":"IF($M$1=\"\",\"\",IF($D448=$M$1,Eingabe!B445,\"\"))","v":""},{"$f":"IF($M$1=\"\",\"\",IF($D448=$M$1,Eingabe!C445,\"\"))","v":""},{"$f":"IF(Eingabe!$A445=$M$1,$M$1,\"\")","v":0},{"$f":"IF($M$1=\"\",\"\",IF($D448=$M$1,Eingabe!G445,\"\"))","v":""}]
[444,{"$f":"IF($M$1=\"\",\"\",IF($D449=$M$1,Eingabe!B446,\"\"))","v":""},{"$f":"IF($M$1=\"\",\"\",IF($D449=$M$1,Eingabe!C446,\"\"))","v":""},{"$f":"IF(Eingabe!$A446=$M$1,$M$1,\"\")","v":0},{"$f":"IF($M$1=\"\",\"\",IF($D449=$M$1,Eingabe!G446,\"\"))","v":""}]
[445,{"$f":"IF($M$1=\"\",\"\",IF($D450=$M$1,Eingabe!B447,\"\"))","v":""},{"$f":"IF($M$1=\"\",\"\",IF($D450=$M$1,Eingabe!C447,\"\"))","v":""},{"$f":"IF(Eingabe!$A447=$M$1,$M$1,\"\")","v":0},{"$f":"IF($M$1=\"\",\"\",IF($D450=$M$1,Eingabe!G447,\"\"))","v":""}]
[446,{"$f":"IF($M$1=\"\",\"\",IF($D451=$M$1,Eingabe!B448,\"\"))","v":""},{"$f":"IF($M$1=\"\",\"\",IF($D451=$M$1,Eingabe!C448,\"\"))","v":""},{"$f":"IF(Eingabe!$A448=$M$1,$M$1,\"\")","v":0},{"$f":"IF($M$1=\"\",\"\",IF($D451=$M$1,Eingabe!G448,\"\"))","v":""}]
[447,{"$f":"IF($M$1=\"\",\"\",IF($D452=$M$1,Eingabe!B449,\"\"))","v":""},{"$f":"IF($M$1=\"\",\"\",IF($D452=$M$1,Eingabe!C449,\"\"))","v":""},{"$f":"IF(Eingabe!$A449=$M$1,$M$1,\"\")","v":0},{"$f":"IF($M$1=\"\",\"\",IF($D452=$M$1,Eingabe!G449,\"\"))","v":""}]
[448,{"$f":"IF($M$1=\"\",\"\",IF($D453=$M$1,Eingabe!B450,\"\"))","v":""},{"$f":"IF($M$1=\"\",\"\",IF($D453=$M$1,Eingabe!C450,\"\"))","v":""},{"$f":"IF(Eingabe!$A450=$M$1,$M$1,\"\")","v":0},{"$f":"IF($M$1=\"\",\"\",IF($D453=$M$1,Eingabe!G450,\"\"))","v":""}]
[449,{"$f":"IF($M$1=\"\",\"\",IF($D454=$M$1,Eingabe!B451,\"\"))","v":""},{"$f":"IF($M$1=\"\",\"\",IF($D454=$M$1,Eingabe!C451,\"\"))","v":""},{"$f":"IF(Eingabe!$A451=$M$1,$M$1,\"\")","v":0},{"$f":"IF($M$1=\"\",\"\",IF($D454=$M$1,Eingabe!G451,\"\"))","v":""}]
[450,{"$f":"IF($M$1=\"\",\"\",IF($D455=$M$1,Eingabe!B452,\"\"))","v":""},{"$f":"IF($M$1=\"\",\"\",IF($D455=$M$1,Eingabe!C452,\"\"))","v":""},{"$f":"IF(Eingabe!$A452=$M$1,$M$1,\"\")","v":0},{"$f":"IF($M$1=\"\",\"\",IF($D455=$M$1,Eingabe!G452,\"\"))","v":""}]
[451,{"$f":"IF($M$1=\"\",\"\",IF($D456=$M$1,Eingabe!B453,\"\"))","v":""},{"$f":"IF($M$1=\"\",\"\",IF($D456=$M$1,Eingabe!C453,\"\"))","v":""},{"$f":"IF(Eingabe!$A453=$M$1,$M$1,\"\")","v":0},{"$f":"IF($M$1=\"\",\"\",IF($D456=$M$1,Eingabe!G453,\"\"))","v":""}]
[452,{"$f":"IF($M$1=\"\",\"\",IF($D457=$M$1,Eingabe!B454,\"\"))","v":""},{"$f":"IF($M$1=\"\",\"\",IF($D457=$M$1,Eingabe!C454,\"\"))","v":""},{"$f":"IF(Eingabe!$A454=$M$1,$M$1,\"\")","v":0},{"$f":"IF($M$1=\"\",\"\",IF($D457=$M$1,Eingabe!G454,\"\"))","v":""}]
[453,{"$f":"IF($M$1=\"\",\"\",IF($D458=$M$1,Eingabe!B455,\"\"))","v":""},{"$f":"IF($M$1=\"\",\"\",IF($D458=$M$1,Eingabe!C455,\"\"))","v":""},{"$f":"IF(Eingabe!$A455=$M$1,$M$1,\"\")","v":0},{"$f":"IF($M$1=\"\",\"\",IF($D458=$M$1,Eingabe!G455,\"\"))","v":""}]
[454,{"$f":"IF($M$1=\"\",\"\",IF($D459=$M$1,Eingabe!B456,\"\"))","v":""},{"$f":"IF($M$1=\"\",\"\",IF($D459=$M$1,Eingabe!C456,\"\"))","v":""},{"$f":"IF(Eingabe!$A456=$M$1,$M$1,\"\")","v":0},{"$f":"IF($M$1=\"\",\"\",IF($D459=$M$1,Eingabe!G456,\"\"))","v":""}]
[455,{"$f":"IF($M$1=\"\",\"\",IF($D460=$M$1,Eingabe!B457,\"\"))","v":""},{"$f":"IF($M$1=\"\",\"\",IF($D460=$M$1,Eingabe!C457,\"\"))","v":""},{"$f":"IF(Eingabe!$A457=$M$1,$M$1,\"\")","v":0},{"$f":"IF($M$1=\"\",\"\",IF($D460=$M$1,Eingabe!G457,\"\"))","v":""}]
[456,{"$f":"IF($M$1=\"\",\"\",IF($D461=$M$1,Eingabe!B458,\"\"))","v":""},{"$f":"IF($M$1=\"\",\"\",IF($D461=$M$1,Eingabe!C458,\"\"))","v":""},{"$f":"IF(Eingabe!$A458=$M$1,$M$1,\"\")","v":0},{"$f":"IF($M$1=\"\",\"\",IF($D461=$M$1,Eingabe!G458,\"\"))","v":""}]
[457,{"$f":"IF($M$1=\"\",\"\",IF($D462=$M$1,Eingabe!B459,\"\"))","v":""},{"$f":"IF($M$1=\"\",\"\",IF($D462=$M$1,Eingabe!C459,\"\"))","v":""},{"$f":"IF(Eingabe!$A459=$M$1,$M$1,\"\")","v":0},{"$f":"IF($M$1=\"\",\"\",IF($D462=$M$1,Eingabe!G459,\"\"))","v":""}]
[458,{"$f":"IF($M$1=\"\",\"\",IF($D463=$M$1,Eingabe!B460,\"\"))","v":""},{"$f":"IF($M$1=\"\",\"\",IF($D463=$M$1,Eingabe!C460,\"\"))","v":""},{"$f":"IF(Eingabe!$A460=$M$1,$M$1,\"\")","v":0},{"$f":"IF($M$1=\"\",\"\",IF($D463=$M$1,Eingabe!G460,\"\"))","v":""}]
[459,{"$f":"IF($M$1=\"\",\"\",IF($D464=$M$1,Eingabe!B461,\"\"))","v":""},{"$f":"IF($M$1=\"\",\"\",IF($D464=$M$1,Eingabe!C461,\"\"))","v":""},{"$f":"IF(Eingabe!$A461=$M$1,$M$1,\"\")","v":0},{"$f":"IF($M$1=\"\",\"\",IF($D464=$M$1,Eingabe!G461,\"\"))","v":""}]
[460,{"$f":"IF($M$1=\"\",\"\",IF($D465=$M$1,Eingabe!B462,\"\"))","v":""},{"$f":"IF($M$1=\"\",\"\",IF($D465=$M$1,Eingabe!C462,\"\"))","v":""},{"$f":"IF(Eingabe!$A462=$M$1,$M$1,\"\")","v":0},{"$f":"IF($M$1=\"\",\"\",IF($D465=$M$1,Eingabe!G462,\"\"))","v":""}]
[461,{"$f":"IF($M$1=\"\",\"\",IF($D466=$M$1,Eingabe!B463,\"\"))","v":""},{"$f":"IF($M$1=\"\",\"\",IF($D466=$M$1,Eingabe!C463,\"\"))","v":""},{"$f":"IF(Eingabe!$A463=$M$1,$M$1,\"\")","v":0},{"$f":"IF($M$1=\"\",\"\",IF($D466=$M$1,Eingabe!G463,\"\"))","v":""}]
[462,{"$f":"IF($M$1=\"\",\"\",IF($D467=$M$1,Eingabe!B464,\"\"))","v":""},{"$f":"IF($M$1=\"\",\"\",IF($D467=$M$1,Eingabe!C464,\"\"))","v":""},{"$f":"IF(Eingabe!$A464=$M$1,$M$1,\"\")","v":0},{"$f":"IF($M$1=\"\",\"\",IF($D467=$M$1,Eingabe!G464,\"\"))","v":""}]
[463,{"$f":"IF($M$1=\"\",\"\",IF($D468=$M$1,Eingabe!B465,\"\"))","v":""},{"$f":"IF($M$1=\"\",\"\",IF($D468=$M$1,Eingabe!C465,\"\"))","v":""},{"$f":"IF(Eingabe!$A465=$M$1,$M$1,\"\")","v":0},{"$f":"IF($M$1=\"\",\"\",IF($D468=$M$1,Eingabe!G465,\"\"))","v":""}]
[464,{"$f":"IF($M$1=\"\",\"\",IF($D469=$M$1,Eingabe!B466,\"\"))","v":""},{"$f":"IF($M$1=\"\",\"\",IF($D469=$M$1,Eingabe!C466,\"\"))","v":""},{"$f":"IF(Eingabe!$A466=$M$1,$M$1,\"\")","v":0},{"$f":"IF($M$1=\"\",\"\",IF($D469=$M$1,Eingabe!G466,\"\"))","v":""}]
[465,{"$f":"IF($M$1=\"\",\"\",IF($D470=$M$1,Eingabe!B467,\"\"))","v":""},{"$f":"IF($M$1=\"\",\"\",IF($D470=$M$1,Eingabe!C467,\"\"))","v":""},{"$f":"IF(Eingabe!$A467=$M$1,$M$1,\"\")","v":0},{"$f":"IF($M$1=\"\",\"\",IF($D470=$M$1,Eingabe!G467,\"\"))","v":""}]
[466,{"$f":"IF($M$1=\"\",\"\",IF($D471=$M$1,Eingabe!B468,\"\"))","v":""},{"$f":"IF($M$1=\"\",\"\",IF($D471=$M$1,Eingabe!C468,\"\"))","v":""},{"$f":"IF(Eingabe!$A468=$M$1,$M$1,\"\")","v":0},{"$f":"IF($M$1=\"\",\"\",IF($D471=$M$1,Eingabe!G468,\"\"))","v":""}]
[467,{"$f":"IF($M$1=\"\",\"\",IF($D472=$M$1,Eingabe!B469,\"\"))","v":""},{"$f":"IF($M$1=\"\",\"\",IF($D472=$M$1,Eingabe!C469,\"\"))","v":""},{"$f":"IF(Eingabe!$A469=$M$1,$M$1,\"\")","v":0},{"$f":"IF($M$1=\"\",\"\",IF($D472=$M$1,Eingabe!G469,\"\"))","v":""}]
[468,{"$f":"IF($M$1=\"\",\"\",IF($D473=$M$1,Eingabe!B470,\"\"))","v":""},{"$f":"IF($M$1=\"\",\"\",IF($D473=$M$1,Eingabe!C470,\"\"))","v":""},{"$f":"IF(Eingabe!$A470=$M$1,$M$1,\"\")","v":0},{"$f":"IF($M$1=\"\",\"\",IF($D473=$M$1,Eingabe!G470,\"\"))","v":""}]
[469,{"$f":"IF($M$1=\"\",\"\",IF($D474=$M$1,Eingabe!B471,\"\"))","v":""},{"$f":"IF($M$1=\"\",\"\",IF($D474=$M$1,Eingabe!C471,\"\"))","v":""},{"$f":"IF(Eingabe!$A471=$M$1,$M$1,\"\")","v":0},{"$f":"IF($M$1=\"\",\"\",IF($D474=$M$1,Eingabe!G471,\"\"))","v":""}]
[470,{"$f":"IF($M$1=\"\",\"\",IF($D475=$M$1,Eingabe!B472,\"\"))","v":""},{"$f":"IF($M$1=\"\",\"\",IF($D475=$M$1,Eingabe!C472,\"\"))","v":""},{"$f":"IF(Eingabe!$A472=$M$1,$M$1,\"\")","v":0},{"$f":"IF($M$1=\"\",\"\",IF($D475=$M$1,Eingabe!G472,\"\"))","v":""}]
[471,{"$f":"IF($M$1=\"\",\"\",IF($D476=$M$1,Eingabe!B473,\"\"))","v":""},{"$f":"IF($M$1=\"\",\"\",IF($D476=$M$1,Eingabe!C473,\"\"))","v":""},{"$f":"IF(Eingabe!$A473=$M$1,$M$1,\"\")","v":0},{"$f":"IF($M$1=\"\",\"\",IF($D476=$M$1,Eingabe!G473,\"\"))","v":""}]
[472,{"$f":"IF($M$1=\"\",\"\",IF($D477=$M$1,Eingabe!B474,\"\"))","v":""},{"$f":"IF($M$1=\"\",\"\",IF($D477=$M$1,Eingabe!C474,\"\"))","v":""},{"$f":"IF(Eingabe!$A474=$M$1,$M$1,\"\")","v":0},{"$f":"IF($M$1=\"\",\"\",IF($D477=$M$1,Eingabe!G474,\"\"))","v":""}]
[473,{"$f":"IF($M$1=\"\",\"\",IF($D478=$M$1,Eingabe!B475,\"\"))","v":""},{"$f":"IF($M$1=\"\",\"\",IF($D478=$M$1,Eingabe!C475,\"\"))","v":""},{"$f":"IF(Eingabe!$A475=$M$1,$M$1,\"\")","v":0},{"$f":"IF($M$1=\"\",\"\",IF($D478=$M$1,Eingabe!G475,\"\"))","v":""}]
[474,{"$f":"IF($M$1=\"\",\"\",IF($D479=$M$1,Eingabe!B476,\"\"))","v":""},{"$f":"IF($M$1=\"\",\"\",IF($D479=$M$1,Eingabe!C476,\"\"))","v":""},{"$f":"IF(Eingabe!$A476=$M$1,$M$1,\"\")","v":0},{"$f":"IF($M$1=\"\",\"\",IF($D479=$M$1,Eingabe!G476,\"\"))","v":""}]
[475,{"$f":"IF($M$1=\"\",\"\",IF($D480=$M$1,Eingabe!B477,\"\"))","v":""},{"$f":"IF($M$1=\"\",\"\",IF($D480=$M$1,Eingabe!C477,\"\"))","v":""},{"$f":"IF(Eingabe!$A477=$M$1,$M$1,\"\")","v":0},{"$f":"IF($M$1=\"\",\"\",IF($D480=$M$1,Eingabe!G477,\"\"))","v":""}]
[476,{"$f":"IF($M$1=\"\",\"\",IF($D481=$M$1,Eingabe!B478,\"\"))","v":""},{"$f":"IF($M$1=\"\",\"\",IF($D481=$M$1,Eingabe!C478,\"\"))","v":""},{"$f":"IF(Eingabe!$A478=$M$1,$M$1,\"\")","v":0},{"$f":"IF($M$1=\"\",\"\",IF($D481=$M$1,Eingabe!G478,\"\"))","v":""}]
[477,{"$f":"IF($M$1=\"\",\"\",IF($D482=$M$1,Eingabe!B479,\"\"))","v":""},{"$f":"IF($M$1=\"\",\"\",IF($D482=$M$1,Eingabe!C479,\"\"))","v":""},{"$f":"IF(Eingabe!$A479=$M$1,$M$1,\"\")","v":0},{"$f":"IF($M$1=\"\",\"\",IF($D482=$M$1,Eingabe!G479,\"\"))","v":""}]
[478,{"$f":"IF($M$1=\"\",\"\",IF($D483=$M$1,Eingabe!B480,\"\"))","v":""},{"$f":"IF($M$1=\"\",\"\",IF($D483=$M$1,Eingabe!C480,\"\"))","v":""},{"$f":"IF(Eingabe!$A480=$M$1,$M$1,\"\")","v":0},{"$f":"IF($M$1=\"\",\"\",IF($D483=$M$1,Eingabe!G480,\"\"))","v":""}]
[479,{"$f":"IF($M$1=\"\",\"\",IF($D484=$M$1,Eingabe!B481,\"\"))","v":""},{"$f":"IF($M$1=\"\",\"\",IF($D484=$M$1,Eingabe!C481,\"\"))","v":""},{"$f":"IF(Eingabe!$A481=$M$1,$M$1,\"\")","v":0},{"$f":"IF($M$1=\"\",\"\",IF($D484=$M$1,Eingabe!G481,\"\"))","v":""}]
[480,{"$f":"IF($M$1=\"\",\"\",IF($D485=$M$1,Eingabe!B482,\"\"))","v":""},{"$f":"IF($M$1=\"\",\"\",IF($D485=$M$1,Eingabe!C482,\"\"))","v":""},{"$f":"IF(Eingabe!$A482=$M$1,$M$1,\"\")","v":0},{"$f":"IF($M$1=\"\",\"\",IF($D485=$M$1,Eingabe!G482,\"\"))","v":""}]
[481,{"$f":"IF($M$1=\"\",\"\",IF($D486=$M$1,Eingabe!B483,\"\"))","v":""},{"$f":"IF($M$1=\"\",\"\",IF($D486=$M$1,Eingabe!C483,\"\"))","v":""},{"$f":"IF(Eingabe!$A483=$M$1,$M$1,\"\")","v":0},{"$f":"IF($M$1=\"\",\"\",IF($D486=$M$1,Eingabe!G483,\"\"))","v":""}]
[482,{"$f":"IF($M$1=\"\",\"\",IF($D487=$M$1,Eingabe!B484,\"\"))","v":""},{"$f":"IF($M$1=\"\",\"\",IF($D487=$M$1,Eingabe!C484,\"\"))","v":""},{"$f":"IF(Eingabe!$A484=$M$1,$M$1,\"\")","v":0},{"$f":"IF($M$1=\"\",\"\",IF($D487=$M$1,Eingabe!G484,\"\"))","v":""}]
[483,{"$f":"IF($M$1=\"\",\"\",IF($D488=$M$1,Eingabe!B485,\"\"))","v":""},{"$f":"IF($M$1=\"\",\"\",IF($D488=$M$1,Eingabe!C485,\"\"))","v":""},{"$f":"IF(Eingabe!$A485=$M$1,$M$1,\"\")","v":0},{"$f":"IF($M$1=\"\",\"\",IF($D488=$M$1,Eingabe!G485,\"\"))","v":""}]
[484,{"$f":"IF($M$1=\"\",\"\",IF($D489=$M$1,Eingabe!B486,\"\"))","v":""},{"$f":"IF($M$1=\"\",\"\",IF($D489=$M$1,Eingabe!C486,\"\"))","v":""},{"$f":"IF(Eingabe!$A486=$M$1,$M$1,\"\")","v":0},{"$f":"IF($M$1=\"\",\"\",IF($D489=$M$1,Eingabe!G486,\"\"))","v":""}]
[485,{"$f":"IF($M$1=\"\",\"\",IF($D490=$M$1,Eingabe!B487,\"\"))","v":""},{"$f":"IF($M$1=\"\",\"\",IF($D490=$M$1,Eingabe!C487,\"\"))","v":""},{"$f":"IF(Eingabe!$A487=$M$1,$M$1,\"\")","v":0},{"$f":"IF($M$1=\"\",\"\",IF($D490=$M$1,Eingabe!G487,\"\"))","v":""}]
[486,{"$f":"IF($M$1=\"\",\"\",IF($D491=$M$1,Eingabe!B488,\"\"))","v":""},{"$f":"IF($M$1=\"\",\"\",IF($D491=$M$1,Eingabe!C488,\"\"))","v":""},{"$f":"IF(Eingabe!$A488=$M$1,$M$1,\"\")","v":0},{"$f":"IF($M$1=\"\",\"\",IF($D491=$M$1,Eingabe!G488,\"\"))","v":""}]
[487,{"$f":"IF($M$1=\"\",\"\",IF($D492=$M$1,Eingabe!B489,\"\"))","v":""},{"$f":"IF($M$1=\"\",\"\",IF($D492=$M$1,Eingabe!C489,\"\"))","v":""},{"$f":"IF(Eingabe!$A489=$M$1,$M$1,\"\")","v":0},{"$f":"IF($M$1=\"\",\"\",IF($D492=$M$1,Eingabe!G489,\"\"))","v":""}]
[488,{"$f":"IF($M$1=\"\",\"\",IF($D493=$M$1,Eingabe!B490,\"\"))","v":""},{"$f":"IF($M$1=\"\",\"\",IF($D493=$M$1,Eingabe!C490,\"\"))","v":""},{"$f":"IF(Eingabe!$A490=$M$1,$M$1,\"\")","v":0},{"$f":"IF($M$1=\"\",\"\",IF($D493=$M$1,Eingabe!G490,\"\"))","v":""}]
[489,{"$f":"IF($M$1=\"\",\"\",IF($D494=$M$1,Eingabe!B491,\"\"))","v":""},{"$f":"IF($M$1=\"\",\"\",IF($D494=$M$1,Eingabe!C491,\"\"))","v":""},{"$f":"IF(Eingabe!$A491=$M$1,$M$1,\"\")","v":0},{"$f":"IF($M$1=\"\",\"\",IF($D494=$M$1,Eingabe!G491,\"\"))","v":""}]
[490,{"$f":"IF($M$1=\"\",\"\",IF($D495=$M$1,Eingabe!B492,\"\"))","v":""},{"$f":"IF($M$1=\"\",\"\",IF($D495=$M$1,Eingabe!C492,\"\"))","v":""},{"$f":"IF(Eingabe!$A492=$M$1,$M$1,\"\")","v":0},{"$f":"IF($M$1=\"\",\"\",IF($D495=$M$1,Eingabe!G492,\"\"))","v":""}]
[491,{"$f":"IF($M$1=\"\",\"\",IF($D496=$M$1,Eingabe!B493,\"\"))","v":""},{"$f":"IF($M$1=\"\",\"\",IF($D496=$M$1,Eingabe!C493,\"\"))","v":""},{"$f":"IF(Eingabe!$A493=$M$1,$M$1,\"\")","v":0},{"$f":"IF($M$1=\"\",\"\",IF($D496=$M$1,Eingabe!G493,\"\"))","v":""}]
[492,{"$f":"IF($M$1=\"\",\"\",IF($D497=$M$1,Eingabe!B494,\"\"))","v":""},{"$f":"IF($M$1=\"\",\"\",IF($D497=$M$1,Eingabe!C494,\"\"))","v":""},{"$f":"IF(Eingabe!$A494=$M$1,$M$1,\"\")","v":0},{"$f":"IF($M$1=\"\",\"\",IF($D497=$M$1,Eingabe!G494,\"\"))","v":""}]
[493,{"$f":"IF($M$1=\"\",\"\",IF($D498=$M$1,Eingabe!B495,\"\"))","v":""},{"$f":"IF($M$1=\"\",\"\",IF($D498=$M$1,Eingabe!C495,\"\"))","v":""},{"$f":"IF(Eingabe!$A495=$M$1,$M$1,\"\")","v":0},{"$f":"IF($M$1=\"\",\"\",IF($D498=$M$1,Eingabe!G495,\"\"))","v":""}]
[494,{"$f":"IF($M$1=\"\",\"\",IF($D499=$M$1,Eingabe!B496,\"\"))","v":""},{"$f":"IF($M$1=\"\",\"\",IF($D499=$M$1,Eingabe!C496,\"\"))","v":""},{"$f":"IF(Eingabe!$A496=$M$1,$M$1,\"\")","v":0},{"$f":"IF($M$1=\"\",\"\",IF($D499=$M$1,Eingabe!G496,\"\"))","v":""}]
[495,{"$f":"IF($M$1=\"\",\"\",IF($D500=$M$1,Eingabe!B497,\"\"))","v":""},{"$f":"IF($M$1=\"\",\"\",IF($D500=$M$1,Eingabe!C497,\"\"))","v":""},{"$f":"IF(Eingabe!$A497=$M$1,$M$1,\"\")","v":0},{"$f":"IF($M$1=\"\",\"\",IF($D500=$M$1,Eingabe!G497,\"\"))","v":""}]

{"sheet":"alle KLassen","index":6,"n_rows":40,"n_cols":13,"rows_kept":40,"cut":false,"hidden":false,"merged":[[1,1,3,4],[1,5,1,12],[2,7,3,9],[2,10,3,12]]}
["","Wettkampfliste 2022",null,null,null,null,null,null,null,null,null,"Kl","6d"]
["","Leichtathletik",null,null,null,"Disziplin"]
["",null,null,null,null,"Ausdauer","Sprint","Weitsprung",null,null,"Wurf"]
["",null,null,null,null,"800 m","50 m"]
[null,"Name","Vorname","Kl.","Alter","Leistung","Leistung","1. V.","2. V.","3. V.","1. V.","2. V.","3. V."]
[1,{"$f":"IF($M$1=\"\",\"\",IF($D6=$M$1,Eingabe!B183,\"\"))","v":"Meyer               "},{"$f":"IF($M$1=\"\",\"\",IF($D6=$M$1,Eingabe!C183,\"\"))","v":"Jutta"},{"$f":"IF(Eingabe!$A183=$M$1,$M$1,\"\")","v":"6d"},{"$f":"IF($M$1=\"\",\"\",IF($D6=$M$1,Eingabe!G183,\"\"))","v":12}]
[2,{"$f":"IF($M$1=\"\",\"\",IF($D7=$M$1,Eingabe!B184,\"\"))","v":"Müller              "},{"$f":"IF($M$1=\"\",\"\",IF($D7=$M$1,Eingabe!C184,\"\"))","v":"Tanja"},{"$f":"IF(Eingabe!$A184=$M$1,$M$1,\"\")","v":"6d"},{"$f":"IF($M$1=\"\",\"\",IF($D7=$M$1,Eingabe!G184,\"\"))","v":12}]
[3,{"$f":"IF($M$1=\"\",\"\",IF($D8=$M$1,Eingabe!B185,\"\"))","v":"Meisner             "},{"$f":"IF($M$1=\"\",\"\",IF($D8=$M$1,Eingabe!C185,\"\"))","v":"wilfried"},{"$f":"IF(Eingabe!$A185=$M$1,$M$1,\"\")","v":"6d"},{"$f":"IF($M$1=\"\",\"\",IF($D8=$M$1,Eingabe!G185,\"\"))","v":11}]
[4,{"$f":"IF($M$1=\"\",\"\",IF($D9=$M$1,Eingabe!B186,\"\"))","v":"Petersen            "},{"$f":"IF($M$1=\"\",\"\",IF($D9=$M$1,Eingabe!C186,\"\"))","v":"Günter"},{"$f":"IF(Eingabe!$A186=$M$1,$M$1,\"\")","v":"6d"},{"$f":"IF($M$1=\"\",\"\",IF($D9=$M$1,Eingabe!G186,\"\"))","v":11}]
[5,{"$f":"IF($M$1=\"\",\"\",IF($D10=$M$1,Eingabe!B187,\"\"))","v":"Pilowski            "},{"$f":"IF($M$1=\"\",\"\",IF($D10=$M$1,Eingabe!C187,\"\"))","v":"Heike"},{"$f":"IF(Eingabe!$A187=$M$1,$M$1,\"\")","v":"6d"},{"$f":"IF($M$1=\"\",\"\",IF($D10=$M$1,Eingabe!G187,\"\"))","v":11}]
[6,{"$f":"IF($M$1=\"\",\"\",IF($D11=$M$1,Eingabe!B188,\"\"))","v":"Pausch              "},{"$f":"IF($M$1=\"\",\"\",IF($D11=$M$1,Eingabe!C188,\"\"))","v":"Jens"},{"$f":"IF(Eingabe!$A188=$M$1,$M$1,\"\")","v":"6d"},{"$f":"IF($M$1=\"\",\"\",IF($D11=$M$1,Eingabe!G188,\"\"))","v":11}]
[7,{"$f":"IF($M$1=\"\",\"\",IF($D12=$M$1,Eingabe!B189,\"\"))","v":"Schösser            "},{"$f":"IF($M$1=\"\",\"\",IF($D12=$M$1,Eingabe!C189,\"\"))","v":"Bernd"},{"$f":"IF(Eingabe!$A189=$M$1,$M$1,\"\")","v":"6d"},{"$f":"IF($M$1=\"\",\"\",IF($D12=$M$1,Eingabe!G189,\"\"))","v":11}]
[8,{"$f":"IF($M$1=\"\",\"\",IF($D13=$M$1,Eingabe!B190,\"\"))","v":"Schmidt             "},{"$f":"IF($M$1=\"\",\"\",IF($D13=$M$1,Eingabe!C190,\"\"))","v":"Karl"},{"$f":"IF(Eingabe!$A190=$M$1,$M$1,\"\")","v":"6d"},{"$f":"IF($M$1=\"\",\"\",IF($D13=$M$1,Eingabe!G190,\"\"))","v":12}]
[9,{"$f":"IF($M$1=\"\",\"\",IF($D14=$M$1,Eingabe!B191,\"\"))","v":"Schützer            "},{"$f":"IF($M$1=\"\",\"\",IF($D14=$M$1,Eingabe!C191,\"\"))","v":"Ulf"},{"$f":"IF(Eingabe!$A191=$M$1,$M$1,\"\")","v":"6d"},{"$f":"IF($M$1=\"\",\"\",IF($D14=$M$1,Eingabe!G191,\"\"))","v":12}]
[10,{"$f":"IF($M$1=\"\",\"\",IF($D15=$M$1,Eingabe!B192,\"\"))","v":"Tönje               "},{"$f":"IF($M$1=\"\",\"\",IF($D15=$M$1,Eingabe!C192,\"\"))","v":"Christoph"},{"$f":"IF(Eingabe!$A192=$M$1,$M$1,\"\")","v":"6d"},{"$f":"IF($M$1=\"\",\"\",IF($D15=$M$1,Eingabe!G192,\"\"))","v":12}]
[11,{"$f":"IF($M$1=\"\",\"\",IF($D16=$M$1,Eingabe!B193,\"\"))","v":"Meyer               "},{"$f":"IF($M$1=\"\",\"\",IF($D16=$M$1,Eingabe!C193,\"\"))","v":"Jutta"},{"$f":"IF(Eingabe!$A193=$M$1,$M$1,\"\")","v":"6d"},{"$f":"IF($M$1=\"\",\"\",IF($D16=$M$1,Eingabe!G193,\"\"))","v":12}]
[12,{"$f":"IF($M$1=\"\",\"\",IF($D17=$M$1,Eingabe!B194,\"\"))","v":"Müller              "},{"$f":"IF($M$1=\"\",\"\",IF($D17=$M$1,Eingabe!C194,\"\"))","v":"Tanja"},{"$f":"IF(Eingabe!$A194=$M$1,$M$1,\"\")","v":"6d"},{"$f":"IF($M$1=\"\",\"\",IF($D17=$M$1,Eingabe!G194,\"\"))","v":12}]
[13,{"$f":"IF($M$1=\"\",\"\",IF($D18=$M$1,Eingabe!B195,\"\"))","v":"Meisner             "},{"$f":"IF($M$1=\"\",\"\",IF($D18=$M$1,Eingabe!C195,\"\"))","v":"wilfried"},{"$f":"IF(Eingabe!$A195=$M$1,$M$1,\"\")","v":"6d"},{"$f":"IF($M$1=\"\",\"\",IF($D18=$M$1,Eingabe!G195,\"\"))","v":11}]
[14,{"$f":"IF($M$1=\"\",\"\",IF($D19=$M$1,Eingabe!B196,\"\"))","v":"Petersen            "},{"$f":"IF($M$1=\"\",\"\",IF($D19=$M$1,Eingabe!C196,\"\"))","v":"Günter"},{"$f":"IF(Eingabe!$A196=$M$1,$M$1,\"\")","v":"6d"},{"$f":"IF($M$1=\"\",\"\",IF($D19=$M$1,Eingabe!G196,\"\"))","v":11}]
[15,{"$f":"IF($M$1=\"\",\"\",IF($D20=$M$1,Eingabe!B197,\"\"))","v":"Pilowski            "},{"$f":"IF($M$1=\"\",\"\",IF($D20=$M$1,Eingabe!C197,\"\"))","v":"Heike"},{"$f":"IF(Eingabe!$A197=$M$1,$M$1,\"\")","v":"6d"},{"$f":"IF($M$1=\"\",\"\",IF($D20=$M$1,Eingabe!G197,\"\"))","v":11}]
[16,{"$f":"IF($M$1=\"\",\"\",IF($D21=$M$1,Eingabe!B198,\"\"))","v":"Pausch              "},{"$f":"IF($M$1=\"\",\"\",IF($D21=$M$1,Eingabe!C198,\"\"))","v":"Jens"},{"$f":"IF(Eingabe!$A198=$M$1,$M$1,\"\")","v":"6d"},{"$f":"IF($M$1=\"\",\"\",IF($D21=$M$1,Eingabe!G198,\"\"))","v":11}]
[17,{"$f":"IF($M$1=\"\",\"\",IF($D22=$M$1,Eingabe!B199,\"\"))","v":"Schösser            "},{"$f":"IF($M$1=\"\",\"\",IF($D22=$M$1,Eingabe!C199,\"\"))","v":"Bernd"},{"$f":"IF(Eingabe!$A199=$M$1,$M$1,\"\")","v":"6d"},{"$f":"IF($M$1=\"\",\"\",IF($D22=$M$1,Eingabe!G199,\"\"))","v":11}]
[18,{"$f":"IF($M$1=\"\",\"\",IF($D23=$M$1,Eingabe!B200,\"\"))","v":"Schmidt             "},{"$f":"IF($M$1=\"\",\"\",IF($D23=$M$1,Eingabe!C200,\"\"))","v":"Karl"},{"$f":"IF(Eingabe!$A200=$M$1,$M$1,\"\")","v":"6d"},{"$f":"IF($M$1=\"\",\"\",IF($D23=$M$1,Eingabe!G200,\"\"))","v":12}]
[19,{"$f":"IF($M$1=\"\",\"\",IF($D24=$M$1,Eingabe!B201,\"\"))","v":"Schützer            "},{"$f":"IF($M$1=\"\",\"\",IF($D24=$M$1,Eingabe!C201,\"\"))","v":"Ulf"},{"$f":"IF(Eingabe!$A201=$M$1,$M$1,\"\")","v":"6d"},{"$f":"IF($M$1=\"\",\"\",IF($D24=$M$1,Eingabe!G201,\"\"))","v":12}]
[20,{"$f":"IF($M$1=\"\",\"\",IF($D25=$M$1,Eingabe!B202,\"\"))","v":"Tönje               "},{"$f":"IF($M$1=\"\",\"\",IF($D25=$M$1,Eingabe!C202,\"\"))","v":"Christoph"},{"$f":"IF(Eingabe!$A202=$M$1,$M$1,\"\")","v":"6d"},{"$f":"IF($M$1=\"\",\"\",IF($D25=$M$1,Eingabe!G202,\"\"))","v":12}]
[21,{"$f":"IF($M$1=\"\",\"\",IF($D26=$M$1,Eingabe!B203,\"\"))","v":"Meyer               "},{"$f":"IF($M$1=\"\",\"\",IF($D26=$M$1,Eingabe!C203,\"\"))","v":"Jutta"},{"$f":"IF(Eingabe!$A203=$M$1,$M$1,\"\")","v":"6d"},{"$f":"IF($M$1=\"\",\"\",IF($D26=$M$1,Eingabe!G203,\"\"))","v":12}]
[22,{"$f":"IF($M$1=\"\",\"\",IF($D27=$M$1,Eingabe!B204,\"\"))","v":"Müller              "},{"$f":"IF($M$1=\"\",\"\",IF($D27=$M$1,Eingabe!C204,\"\"))","v":"Tanja"},{"$f":"IF(Eingabe!$A204=$M$1,$M$1,\"\")","v":"6d"},{"$f":"IF($M$1=\"\",\"\",IF($D27=$M$1,Eingabe!G204,\"\"))","v":12}]
[23,{"$f":"IF($M$1=\"\",\"\",IF($D28=$M$1,Eingabe!B205,\"\"))","v":"Meisner             "},{"$f":"IF($M$1=\"\",\"\",IF($D28=$M$1,Eingabe!C205,\"\"))","v":"wilfried"},{"$f":"IF(Eingabe!$A205=$M$1,$M$1,\"\")","v":"6d"},{"$f":"IF($M$1=\"\",\"\",IF($D28=$M$1,Eingabe!G205,\"\"))","v":11}]
[24,{"$f":"IF($M$1=\"\",\"\",IF($D29=$M$1,Eingabe!B206,\"\"))","v":"Petersen            "},{"$f":"IF($M$1=\"\",\"\",IF($D29=$M$1,Eingabe!C206,\"\"))","v":"Günter"},{"$f":"IF(Eingabe!$A206=$M$1,$M$1,\"\")","v":"6d"},{"$f":"IF($M$1=\"\",\"\",IF($D29=$M$1,Eingabe!G206,\"\"))","v":11}]
[25,{"$f":"IF($M$1=\"\",\"\",IF($D30=$M$1,Eingabe!B207,\"\"))","v":"Pilowski            "},{"$f":"IF($M$1=\"\",\"\",IF($D30=$M$1,Eingabe!C207,\"\"))","v":"Heike"},{"$f":"IF(Eingabe!$A207=$M$1,$M$1,\"\")","v":"6d"},{"$f":"IF($M$1=\"\",\"\",IF($D30=$M$1,Eingabe!G207,\"\"))","v":11}]
[26,{"$f":"IF($M$1=\"\",\"\",IF($D31=$M$1,Eingabe!B208,\"\"))","v":"Pausch              "},{"$f":"IF($M$1=\"\",\"\",IF($D31=$M$1,Eingabe!C208,\"\"))","v":"Jens"},{"$f":"IF(Eingabe!$A208=$M$1,$M$1,\"\")","v":"6d"},{"$f":"IF($M$1=\"\",\"\",IF($D31=$M$1,Eingabe!G208,\"\"))","v":11}]
[27,{"$f":"IF($M$1=\"\",\"\",IF($D32=$M$1,Eingabe!B209,\"\"))","v":"Schösser            "},{"$f":"IF($M$1=\"\",\"\",IF($D32=$M$1,Eingabe!C209,\"\"))","v":"Bernd"},{"$f":"IF(Eingabe!$A209=$M$1,$M$1,\"\")","v":"6d"},{"$f":"IF($M$1=\"\",\"\",IF($D32=$M$1,Eingabe!G209,\"\"))","v":11}]
[28,{"$f":"IF($M$1=\"\",\"\",IF($D33=$M$1,Eingabe!B210,\"\"))","v":"Schmidt             "},{"$f":"IF($M$1=\"\",\"\",IF($D33=$M$1,Eingabe!C210,\"\"))","v":"Karl"},{"$f":"IF(Eingabe!$A210=$M$1,$M$1,\"\")","v":"6d"},{"$f":"IF($M$1=\"\",\"\",IF($D33=$M$1,Eingabe!G210,\"\"))","v":12}]
[29,{"$f":"IF($M$1=\"\",\"\",IF($D34=$M$1,Eingabe!B211,\"\"))","v":"Schützer            "},{"$f":"IF($M$1=\"\",\"\",IF($D34=$M$1,Eingabe!C211,\"\"))","v":"Ulf"},{"$f":"IF(Eingabe!$A211=$M$1,$M$1,\"\")","v":"6d"},{"$f":"IF($M$1=\"\",\"\",IF($D34=$M$1,Eingabe!G211,\"\"))","v":12}]
[30,{"$f":"IF($M$1=\"\",\"\",IF($D35=$M$1,Eingabe!B212,\"\"))","v":"Tönje               "},{"$f":"IF($M$1=\"\",\"\",IF($D35=$M$1,Eingabe!C212,\"\"))","v":"Christoph"},{"$f":"IF(Eingabe!$A212=$M$1,$M$1,\"\")","v":"6d"},{"$f":"IF($M$1=\"\",\"\",IF($D35=$M$1,Eingabe!G212,\"\"))","v":12}]
[31]
[32]
[33]
[34]
[35]